Build failure of network:osmocom:nightly/openbsc in xUbuntu_19.04/x86_64

OBS Notification admin at opensuse.org
Tue May 21 16:33:50 UTC 2019


Visit https://build.opensuse.org/package/live_build_log/network:osmocom:nightly/openbsc/xUbuntu_19.04/x86_64

Package network:osmocom:nightly/openbsc failed to build in xUbuntu_19.04/x86_64

Check out the package for editing:
  osc checkout network:osmocom:nightly openbsc

Last lines of build log:
[  167s] | configure: exit 0
[  167s] 
[  167s] #                             -*- compilation -*-
[  167s] 4. testsuite.at:23: testing db ...
[  167s] ./testsuite.at:28: $abs_top_builddir/tests/db/db_test
[  167s] --- expout	2019-05-21 16:33:31.332000000 +0000
[  167s] +++ /usr/src/packages/BUILD/openbsc/tests/testsuite.dir/at-groups/4/stdout	2019-05-21 16:33:31.488000000 +0000
[  167s] @@ -1,4 +1,6 @@
[  167s]  Testing subscriber database code.
[  167s]  DB: Database initialized.
[  167s] +no tables in statement !
[  167s] +no tables in statement !
[  167s]  DB: Database prepared.
[  167s]  Done
[  167s] 4. testsuite.at:23: 4. db (testsuite.at:23): FAILED (testsuite.at:28)
[  167s] make[1]: *** [debian/rules:30: override_dh_auto_test] Error 1
[  167s] make[1]: Leaving directory '/usr/src/packages/BUILD'
[  167s] make: *** [debian/rules:13: build] Error 2
[  167s] dpkg-buildpackage: error: debian/rules build subprocess returned exit status 2
[  167s] 
[  167s] lamb11 failed "build openbsc_1.2.0.20190521.dsc" at Tue May 21 16:33:32 UTC 2019.
[  167s] 
[  167s] ### VM INTERACTION START ###
[  171s] [  158.230127] sysrq: SysRq : Power Off
[  171s] [  158.236191] reboot: Power down
[  171s] ### VM INTERACTION END ###
[  171s] 
[  171s] lamb11 failed "build openbsc_1.2.0.20190521.dsc" at Tue May 21 16:33:36 UTC 2019.
[  171s] 

-- 
Configure notifications at https://build.opensuse.org/user/notifications
openSUSE Build Service (https://build.opensuse.org/)


More information about the gerrit-log mailing list