Build failure of network:osmocom:latest/osmo-sgsn in xUbuntu_18.04/x86_64

OBS Notification admin at opensuse.org
Wed May 8 03:33:21 UTC 2019


Visit https://build.opensuse.org/package/live_build_log/network:osmocom:latest/osmo-sgsn/xUbuntu_18.04/x86_64

Package network:osmocom:latest/osmo-sgsn failed to build in xUbuntu_18.04/x86_64

Check out the package for editing:
  osc checkout network:osmocom:latest osmo-sgsn

Last lines of build log:
[  273s]  
[  273s]  PROCESSING ALIVE_ACK from 0x05060708:32000
[  273s]  0b 
[  273s] @@ -7311,7 +7311,7 @@
[  273s]  MESSAGE to SGSN at 0x05060708:32000, msg length 1
[  273s]  0a 
[  273s]  
[  273s] -result (RESET_ACK) = 1
[  273s] +result (RESET_ACK) = 0
[  273s]  
[  273s]  PROCESSING ALIVE_ACK from 0x05060708:32000
[  273s]  0b 
[  273s] 2. testsuite.at:10: 2. gbproxy (testsuite.at:10): FAILED (testsuite.at:13)
[  273s] debian/rules:65: recipe for target 'override_dh_auto_test' failed
[  273s] make[1]: *** [override_dh_auto_test] Error 1
[  273s] make[1]: Leaving directory '/usr/src/packages/BUILD'
[  273s] debian/rules:45: recipe for target 'build' failed
[  273s] make: *** [build] Error 2
[  273s] dpkg-buildpackage: error: debian/rules build subprocess returned exit status 2
[  273s] 
[  273s] lamb09 failed "build osmo-sgsn_1.4.0.dsc" at Wed May  8 03:33:08 UTC 2019.
[  273s] 
[  273s] ### VM INTERACTION START ###
[  276s] [  262.190951] sysrq: SysRq : Power Off
[  276s] [  262.211765] reboot: Power down
[  276s] ### VM INTERACTION END ###
[  276s] 
[  276s] lamb09 failed "build osmo-sgsn_1.4.0.dsc" at Wed May  8 03:33:11 UTC 2019.
[  276s] 

-- 
Configure notifications at https://build.opensuse.org/user/notifications
openSUSE Build Service (https://build.opensuse.org/)


More information about the gerrit-log mailing list