Build failure of network:osmocom:latest/osmo-bsc in xUbuntu_16.04/x86_64

OBS Notification admin at opensuse.org
Wed May 8 03:17:38 UTC 2019


Visit https://build.opensuse.org/package/live_build_log/network:osmocom:latest/osmo-bsc/xUbuntu_16.04/x86_64

Package network:osmocom:latest/osmo-bsc failed to build in xUbuntu_16.04/x86_64

Check out the package for editing:
  osc checkout network:osmocom:latest osmo-bsc

Last lines of build log:
[  155s] DRSL handover_fsm.c:844 handover(intraBSC_conn4294967295_IMSI000001){WAIT_LCHAN_ACTIVE}: Freeing instance
[  155s] DRSL fsm.c:535 handover(intraBSC_conn4294967295_IMSI000001){WAIT_LCHAN_ACTIVE}: Deallocated
[  155s] DCHAN lchan_fsm.c:544 lchan(1-0-1-TCH_F-0){WAIT_BEFORE_RF_RELEASE}: state_chg to UNUSED
[  155s] DCHAN lchan_fsm.c:377 lchan(1-0-1-TCH_F-0){UNUSED}: (type=TCH_F) Clearing lchan state
[  155s] DTS lchan_fsm.c:410 timeslot(1-0-1-TCH_F){UNUSED}: Received Event TS_EV_LCHAN_UNUSED
[  155s] - Expecting channel request at BTS 1 TS 1
[  155s] --- expout	2019-05-08 03:16:58.168000000 +0000
[  155s] +++ /usr/src/packages/BUILD/tests/testsuite.dir/at-groups/18/stdout	2019-05-08 03:16:58.172000000 +0000
[  155s] @@ -1 +1 @@
[  155s] -Test OK
[  155s] +Test failed, because no channel was requested
[  155s] ./testsuite.at:111: exit code was 1, expected 0
[  155s] 18. testsuite.at:108: 18. handover test 10 (testsuite.at:108): FAILED (testsuite.at:111)
[  155s] debian/rules:62: recipe for target 'override_dh_auto_test' failed
[  155s] make[1]: *** [override_dh_auto_test] Error 1
[  155s] make[1]: Leaving directory '/usr/src/packages/BUILD'
[  155s] debian/rules:45: recipe for target 'build' failed
[  155s] make: *** [build] Error 2
[  155s] dpkg-buildpackage: error: debian/rules build gave error exit status 2
[  155s] 
[  155s] lamb16 failed "build osmo-bsc_1.4.0.dsc" at Wed May  8 03:17:19 UTC 2019.
[  155s] 
[  155s] ### VM INTERACTION START ###
[  158s] [  146.326007] sysrq: SysRq : Power Off
[  158s] [  146.332423] reboot: Power down
[  158s] ### VM INTERACTION END ###
[  158s] 
[  158s] lamb16 failed "build osmo-bsc_1.4.0.dsc" at Wed May  8 03:17:23 UTC 2019.
[  158s] 

-- 
Configure notifications at https://build.opensuse.org/user/notifications
openSUSE Build Service (https://build.opensuse.org/)


More information about the gerrit-log mailing list