Build failure of network:osmocom:nightly/libosmo-netif in xUbuntu_17.10/x86_64

OBS Notification admin at opensuse.org
Tue May 7 02:54:25 UTC 2019


Visit https://build.opensuse.org/package/live_build_log/network:osmocom:nightly/libosmo-netif/xUbuntu_17.10/x86_64

Package network:osmocom:nightly/libosmo-netif failed to build in xUbuntu_17.10/x86_64

Check out the package for editing:
  osc checkout network:osmocom:nightly libosmo-netif

Last lines of build log:
[  264s]  autoreconnecting test step 3 [client OK, server OK], FD reg 1
[  264s]  
[  264s]  autoreconnecting test step 2 [client OK, server OK], FD reg 0
[  264s] +
[  264s] +autoreconnecting test step 1 [client OK, server OK], FD reg 0
[  264s]  connection closed with srv
[  264s]  
[  264s] -autoreconnecting test step 1 [client OK, server NA], FD reg 0
[  264s] +autoreconnecting test step 0 [client OK, server NA], FD reg 0
[  264s]  
[  264s]  non-reconnecting test step 7 [client NA, server OK], FD reg 1
[  264s]  
[  264s] 1. testsuite.at:4: 1. stream_test (testsuite.at:4): FAILED (testsuite.at:8)
[  264s] debian/rules:27: recipe for target 'override_dh_auto_test' failed
[  264s] make[1]: *** [override_dh_auto_test] Error 1
[  264s] make[1]: Leaving directory '/usr/src/packages/BUILD'
[  264s] debian/rules:13: recipe for target 'build' failed
[  264s] make: *** [build] Error 2
[  264s] dpkg-buildpackage: error: debian/rules build gave error exit status 2
[  264s] 
[  264s] lamb28 failed "build libosmo-netif_0.4.0.25.e380.dsc" at Tue May  7 02:54:11 UTC 2019.
[  264s] 
[  264s] ### VM INTERACTION START ###
[  267s] [  244.678808] sysrq: SysRq : Power Off
[  267s] [  244.725265] reboot: Power down
[  267s] ### VM INTERACTION END ###
[  267s] 
[  267s] lamb28 failed "build libosmo-netif_0.4.0.25.e380.dsc" at Tue May  7 02:54:14 UTC 2019.
[  267s] 

-- 
Configure notifications at https://build.opensuse.org/user/notifications
openSUSE Build Service (https://build.opensuse.org/)


More information about the gerrit-log mailing list