Build failure of network:osmocom:nightly/libosmo-netif in xUbuntu_18.10/x86_64

OBS Notification admin at opensuse.org
Sat Mar 30 20:04:21 UTC 2019


Visit https://build.opensuse.org/package/live_build_log/network:osmocom:nightly/libosmo-netif/xUbuntu_18.10/x86_64

Package network:osmocom:nightly/libosmo-netif failed to build in xUbuntu_18.10/x86_64

Check out the package for editing:
  osc checkout network:osmocom:nightly libosmo-netif

Last lines of build log:
[  142s] | #define HAVE_STDINT_H 1
[  142s] | #define HAVE_UNISTD_H 1
[  142s] | #define HAVE_DLFCN_H 1
[  142s] | #define LT_OBJDIR ".libs/"
[  142s] | #define STDC_HEADERS 1
[  142s] | #define HAVE_EXECINFO_H 1
[  142s] | #define HAVE_SYS_SELECT_H 1
[  142s] | #define HAVE_SYS_SOCKET_H 1
[  142s] | #define HAVE_SYSLOG_H 1
[  142s] | #define HAVE_CTYPE_H 1
[  142s] | #define HAVE_LIBSCTP 1
[  142s] | #define HAVE_PCAP_H 1
[  142s] | 
[  142s] | configure: exit 0
[  142s] 
[  142s] make[1]: *** [debian/rules:27: override_dh_auto_test] Error 1
[  142s] make[1]: Leaving directory '/usr/src/packages/BUILD'
[  142s] make: *** [debian/rules:13: build] Error 2
[  142s] dpkg-buildpackage: error: debian/rules build subprocess returned exit status 2
[  142s] 
[  142s] lamb16 failed "build libosmo-netif_0.4.0.25.e380.dsc" at Sat Mar 30 20:04:06 UTC 2019.
[  142s] 
[  142s] ### VM INTERACTION START ###
[  145s] [  133.259769] sysrq: SysRq : Power Off
[  145s] [  133.265565] reboot: Power down
[  145s] ### VM INTERACTION END ###
[  145s] 
[  145s] lamb16 failed "build libosmo-netif_0.4.0.25.e380.dsc" at Sat Mar 30 20:04:10 UTC 2019.
[  145s] 

-- 
Configure notifications at https://build.opensuse.org/user/notifications
openSUSE Build Service (https://build.opensuse.org/)


More information about the gerrit-log mailing list