Build failure of network:osmocom:nightly/libosmo-netif in xUbuntu_18.10/x86_64

OBS Notification admin at opensuse.org
Sat Mar 16 02:53:20 UTC 2019


Visit https://build.opensuse.org/package/live_build_log/network:osmocom:nightly/libosmo-netif/xUbuntu_18.10/x86_64

Package network:osmocom:nightly/libosmo-netif failed to build in xUbuntu_18.10/x86_64

Check out the package for editing:
  osc checkout network:osmocom:nightly libosmo-netif

Last lines of build log:
[  161s] | #define HAVE_STDINT_H 1
[  161s] | #define HAVE_UNISTD_H 1
[  161s] | #define HAVE_DLFCN_H 1
[  161s] | #define LT_OBJDIR ".libs/"
[  161s] | #define STDC_HEADERS 1
[  161s] | #define HAVE_EXECINFO_H 1
[  161s] | #define HAVE_SYS_SELECT_H 1
[  161s] | #define HAVE_SYS_SOCKET_H 1
[  161s] | #define HAVE_SYSLOG_H 1
[  161s] | #define HAVE_CTYPE_H 1
[  161s] | #define HAVE_LIBSCTP 1
[  161s] | #define HAVE_PCAP_H 1
[  161s] | 
[  161s] | configure: exit 0
[  161s] 
[  161s] make[1]: *** [debian/rules:27: override_dh_auto_test] Error 1
[  161s] make[1]: Leaving directory '/usr/src/packages/BUILD'
[  161s] make: *** [debian/rules:13: build] Error 2
[  161s] dpkg-buildpackage: error: debian/rules build subprocess returned exit status 2
[  161s] 
[  161s] lamb23 failed "build libosmo-netif_0.4.0.23.1ab2.dsc" at Sat Mar 16 02:53:08 UTC 2019.
[  161s] 
[  161s] ### VM INTERACTION START ###
[  164s] [  148.799260] sysrq: SysRq : Power Off
[  164s] [  148.813822] reboot: Power down
[  164s] ### VM INTERACTION END ###
[  164s] 
[  164s] lamb23 failed "build libosmo-netif_0.4.0.23.1ab2.dsc" at Sat Mar 16 02:53:12 UTC 2019.
[  164s] 

-- 
Configure notifications at https://build.opensuse.org/user/notifications
openSUSE Build Service (https://build.opensuse.org/)


More information about the gerrit-log mailing list