Build failure of network:osmocom:nightly/openbsc in xUbuntu_18.10/x86_64

OBS Notification admin at
Fri Mar 22 02:48:35 UTC 2019


Package network:osmocom:nightly/openbsc failed to build in xUbuntu_18.10/x86_64

Check out the package for editing:
  osc checkout network:osmocom:nightly openbsc

Last lines of build log:
[  137s] /usr/include/osmocom/core/application.h:20:5: note: declared here
[  137s]  int osmo_init_logging(const struct log_info *)
[  137s]      ^~~~~~~~~~~~~~~~~
[  137s] /bin/bash ../../libtool  --tag=CC   --mode=link gcc -Wall  -I/usr/include/ -I/usr/include/ -I/usr/include/ -I/usr/include/ -I/usr/include/ -I/usr/include/   -g -O2 -fdebug-prefix-map=/usr/src/packages/BUILD=. -fstack-protector-strong -Wformat -Werror=format-security -Werror=implicit -Werror=maybe-uninitialized -Werror=memset-transposed-args -Werror=null-dereference -Werror=sizeof-array-argument -Werror=sizeof-pointer-memaccess   -Wl,-Bsymbolic-functions -Wl,-z,relro -Wl,-z,now -o osmo-nitb bsc_hack.o ../../src/libbsc/libbsc.a ../../src/libcommon-cs/libcommon-cs.a ../../src/libmsc/libmsc.a ../../src/libtrau/libtrau.a ../../src/libcommon/libcommon.a -ltalloc -losmogsm -losmocore -ltalloc -losmovty -losmocore -ltalloc -losmocore -ltalloc -losmoctrl -losmogsm -losmocore -losmoabis -lsmpp34  -ldbi  
[  138s] libtool: link: gcc -Wall -I/usr/include/ -I/usr/include/ -I/usr/include/ -I/usr/include/ -I/usr/include/ -I/usr/include/ -g -O2 -fdebug-prefix-map=/usr/src/packages/BUILD=. -fstack-protector-strong -Wformat -Werror=format-security -Werror=implicit -Werror=maybe-uninitialized -Werror=memset-transposed-args -Werror=null-dereference -Werror=sizeof-array-argument -Werror=sizeof-pointer-memaccess -Wl,-Bsymbolic-functions -Wl,-z -Wl,relro -Wl,-z -Wl,now -o osmo-nitb bsc_hack.o  ../../src/libbsc/libbsc.a ../../src/libcommon-cs/libcommon-cs.a ../../src/libmsc/libmsc.a ../../src/libtrau/libtrau.a ../../src/libcommon/libcommon.a /usr/lib/x86_64-linux-gnu/ -ltalloc /usr/lib/x86_64-linux-gnu/ /usr/lib/x86_64-linux-gnu/ /usr/lib/x86_64-linux-gnu/ /usr/lib/x86_64-linux-gnu/ /usr/lib/x86_64-linux-gnu/ -ldbi
[  138s] /usr/bin/ld: ../../src/libcommon/libcommon.a(talloc_ctx.o): in function `talloc_ctx_init':
[  138s] ./openbsc/src/libcommon/talloc_ctx.c:50: undefined reference to `tall_sigh_ctx'
[  138s] collect2: error: ld returned 1 exit status
[  138s] make[4]: *** [Makefile:485: osmo-nitb] Error 1
[  138s] make[4]: Leaving directory '/usr/src/packages/BUILD/openbsc/src/osmo-nitb'
[  138s] make[3]: *** [Makefile:450: all-recursive] Error 1
[  138s] make[3]: Leaving directory '/usr/src/packages/BUILD/openbsc/src'
[  138s] make[2]: *** [Makefile:470: all-recursive] Error 1
[  138s] make[2]: Leaving directory '/usr/src/packages/BUILD/openbsc'
[  138s] make[1]: *** [Makefile:402: all] Error 2
[  138s] make[1]: Leaving directory '/usr/src/packages/BUILD/openbsc'
[  138s] dh_auto_build: cd openbsc && make -j1 returned exit code 2
[  138s] make: *** [debian/rules:13: build] Error 2
[  138s] dpkg-buildpackage: error: debian/rules build subprocess returned exit status 2
[  138s] 
[  138s] lamb58 failed "build openbsc_1.2.0.20190322.dsc" at Fri Mar 22 02:48:16 UTC 2019.
[  138s] 
[  138s] ### VM INTERACTION START ###
[  141s] [  128.684256] sysrq: SysRq : Power Off
[  141s] [  128.691242] reboot: Power down
[  141s] ### VM INTERACTION END ###
[  141s] 
[  141s] lamb58 failed "build openbsc_1.2.0.20190322.dsc" at Fri Mar 22 02:48:19 UTC 2019.
[  141s] 

Configure notifications at
openSUSE Build Service (

More information about the gerrit-log mailing list