Build failure of network:osmocom:nightly/openbsc in xUbuntu_18.10/x86_64

OBS Notification admin at opensuse.org
Thu Mar 21 20:42:15 UTC 2019


Visit https://build.opensuse.org/package/live_build_log/network:osmocom:nightly/openbsc/xUbuntu_18.10/x86_64

Package network:osmocom:nightly/openbsc failed to build in xUbuntu_18.10/x86_64

Check out the package for editing:
  osc checkout network:osmocom:nightly openbsc

Last lines of build log:
[  161s] /usr/include/osmocom/core/application.h:20:5: note: declared here
[  161s]  int osmo_init_logging(const struct log_info *)
[  161s]      ^~~~~~~~~~~~~~~~~
[  161s] /bin/bash ../../libtool  --tag=CC   --mode=link gcc -Wall  -I/usr/include/ -I/usr/include/ -I/usr/include/ -I/usr/include/ -I/usr/include/ -I/usr/include/   -g -O2 -fdebug-prefix-map=/usr/src/packages/BUILD=. -fstack-protector-strong -Wformat -Werror=format-security -Werror=implicit -Werror=maybe-uninitialized -Werror=memset-transposed-args -Werror=null-dereference -Werror=sizeof-array-argument -Werror=sizeof-pointer-memaccess   -Wl,-Bsymbolic-functions -Wl,-z,relro -Wl,-z,now -o osmo-nitb bsc_hack.o ../../src/libbsc/libbsc.a ../../src/libcommon-cs/libcommon-cs.a ../../src/libmsc/libmsc.a ../../src/libtrau/libtrau.a ../../src/libcommon/libcommon.a -ltalloc -losmogsm -losmocore -ltalloc -losmovty -losmocore -ltalloc -losmocore -ltalloc -losmoctrl -losmogsm -losmocore -losmoabis -lsmpp34  -ldbi  
[  161s] libtool: link: gcc -Wall -I/usr/include/ -I/usr/include/ -I/usr/include/ -I/usr/include/ -I/usr/include/ -I/usr/include/ -g -O2 -fdebug-prefix-map=/usr/src/packages/BUILD=. -fstack-protector-strong -Wformat -Werror=format-security -Werror=implicit -Werror=maybe-uninitialized -Werror=memset-transposed-args -Werror=null-dereference -Werror=sizeof-array-argument -Werror=sizeof-pointer-memaccess -Wl,-Bsymbolic-functions -Wl,-z -Wl,relro -Wl,-z -Wl,now -o osmo-nitb bsc_hack.o  ../../src/libbsc/libbsc.a ../../src/libcommon-cs/libcommon-cs.a ../../src/libmsc/libmsc.a ../../src/libtrau/libtrau.a ../../src/libcommon/libcommon.a /usr/lib/x86_64-linux-gnu/libosmovty.so -ltalloc /usr/lib/x86_64-linux-gnu/libosmoctrl.so /usr/lib/x86_64-linux-gnu/libosmogsm.so /usr/lib/x86_64-linux-gnu/libosmocore.so /usr/lib/x86_64-linux-gnu/libosmoabis.so /usr/lib/x86_64-linux-gnu/libsmpp34.so -ldbi
[  162s] /usr/bin/ld: ../../src/libcommon/libcommon.a(talloc_ctx.o): in function `talloc_ctx_init':
[  162s] ./openbsc/src/libcommon/talloc_ctx.c:50: undefined reference to `tall_sigh_ctx'
[  162s] collect2: error: ld returned 1 exit status
[  162s] make[4]: *** [Makefile:485: osmo-nitb] Error 1
[  162s] make[4]: Leaving directory '/usr/src/packages/BUILD/openbsc/src/osmo-nitb'
[  162s] make[3]: *** [Makefile:450: all-recursive] Error 1
[  162s] make[3]: Leaving directory '/usr/src/packages/BUILD/openbsc/src'
[  162s] make[2]: *** [Makefile:470: all-recursive] Error 1
[  162s] make[2]: Leaving directory '/usr/src/packages/BUILD/openbsc'
[  162s] make[1]: *** [Makefile:402: all] Error 2
[  162s] make[1]: Leaving directory '/usr/src/packages/BUILD/openbsc'
[  162s] dh_auto_build: cd openbsc && make -j1 returned exit code 2
[  162s] make: *** [debian/rules:13: build] Error 2
[  162s] dpkg-buildpackage: error: debian/rules build subprocess returned exit status 2
[  162s] 
[  162s] lamb07 failed "build openbsc_1.2.0.20190321.dsc" at Thu Mar 21 20:42:03 UTC 2019.
[  162s] 
[  162s] ### VM INTERACTION START ###
[  165s] [  153.374030] sysrq: SysRq : Power Off
[  165s] [  153.401555] reboot: Power down
[  165s] ### VM INTERACTION END ###
[  165s] 
[  165s] lamb07 failed "build openbsc_1.2.0.20190321.dsc" at Thu Mar 21 20:42:07 UTC 2019.
[  165s] 

-- 
Configure notifications at https://build.opensuse.org/user/notifications
openSUSE Build Service (https://build.opensuse.org/)


More information about the gerrit-log mailing list