Build failure of network:osmocom:nightly/libosmocore in Raspbian_9.0/armv7l

OBS Notification admin at opensuse.org
Fri Jun 28 02:48:09 UTC 2019


Visit https://build.opensuse.org/package/live_build_log/network:osmocom:nightly/libosmocore/Raspbian_9.0/armv7l

Package network:osmocom:nightly/libosmocore failed to build in Raspbian_9.0/armv7l

Check out the package for editing:
  osc checkout network:osmocom:nightly libosmocore

Last lines of build log:
[  983s] -Returned: 0, Current node: 1 '%s> '
[  983s] -Going to execute 'ambiguous_str'
[  983s] -Called: 'ambiguous_str [ARG]' (argc=0)
[  983s] -Returned: 0, Current node: 1 '%s> '
[  983s] -Going to execute 'ambiguous_str arg'
[  983s] -Called: 'ambiguous_str [ARG]' (argc=1)
[  983s] -Returned: 0, Current node: 1 '%s> '
[  983s] -Going to execute 'ambiguous_str arg keyword'
[  983s] -Called: 'ambiguous_str ARG keyword'
[  983s] -Returned: 0, Current node: 1 '%s> '
[  983s] -All tests passed
[  983s] ./testsuite.at:196: exit code was 139, expected 0
[  983s] 31. testsuite.at:192: 31. vty (testsuite.at:192): FAILED (testsuite.at:196)
[  983s] debian/rules:26: recipe for target 'override_dh_auto_test' failed
[  983s] make[1]: *** [override_dh_auto_test] Error 1
[  983s] make[1]: Leaving directory '/usr/src/packages/BUILD'
[  983s] debian/rules:15: recipe for target 'build' failed
[  983s] make: *** [build] Error 2
[  983s] dpkg-buildpackage: error: debian/rules build gave error exit status 2
[  983s] 
[  983s] obs-arm-5 failed "build libosmocore_1.1.0.73.e1e1.dsc" at Fri Jun 28 02:47:54 UTC 2019.
[  983s] 
[  983s] ### VM INTERACTION START ###
[  985s] [  951.871818] sysrq: SysRq : Power Off
[  985s] [  951.874023] reboot: Power down
[  986s] ### VM INTERACTION END ###
[  986s] 
[  986s] obs-arm-5 failed "build libosmocore_1.1.0.73.e1e1.dsc" at Fri Jun 28 02:47:58 UTC 2019.
[  986s] 

-- 
Configure notifications at https://build.opensuse.org/user/notifications
openSUSE Build Service (https://build.opensuse.org/)


More information about the gerrit-log mailing list