Build failure of network:osmocom:nightly/libosmocore in Raspbian_9.0/armv7l

OBS Notification admin at opensuse.org
Thu Jun 27 02:42:26 UTC 2019


Visit https://build.opensuse.org/package/live_build_log/network:osmocom:nightly/libosmocore/Raspbian_9.0/armv7l

Package network:osmocom:nightly/libosmocore failed to build in Raspbian_9.0/armv7l

Check out the package for editing:
  osc checkout network:osmocom:nightly libosmocore

Last lines of build log:
[  463s] | This file was extended by libosmocore config.status 1.1.0.73-e1e1, which was
[  463s] | generated by GNU Autoconf 2.69.  Invocation command line was
[  463s] | 
[  463s] |   CONFIG_FILES    = 
[  463s] |   CONFIG_HEADERS  = 
[  463s] |   CONFIG_LINKS    = 
[  463s] |   CONFIG_COMMANDS = 
[  463s] |   $ ./config.status Doxyfile.core
[  463s] | 
[  463s] | on armbuild26
[  463s] | 
[  463s] | config.status:1200: creating Doxyfile.core
[  463s] 
[  463s] debian/rules:26: recipe for target 'override_dh_auto_test' failed
[  463s] make[1]: *** [override_dh_auto_test] Error 1
[  463s] make[1]: Leaving directory '/usr/src/packages/BUILD'
[  463s] debian/rules:15: recipe for target 'build' failed
[  463s] make: *** [build] Error 2
[  463s] dpkg-buildpackage: error: debian/rules build gave error exit status 2
[  463s] 
[  463s] armbuild26 failed "build libosmocore_1.1.0.73.e1e1.dsc" at Thu Jun 27 02:42:11 UTC 2019.
[  463s] 
[  463s] ### VM INTERACTION START ###
[  466s] [  442.399703] sysrq: SysRq : Power Off
[  466s] [  442.403526] reboot: Power down
[  466s] ### VM INTERACTION END ###
[  466s] 
[  466s] armbuild26 failed "build libosmocore_1.1.0.73.e1e1.dsc" at Thu Jun 27 02:42:15 UTC 2019.
[  466s] 

-- 
Configure notifications at https://build.opensuse.org/user/notifications
openSUSE Build Service (https://build.opensuse.org/)


More information about the gerrit-log mailing list