Build failure of network:osmocom:latest/openbsc in Debian_Unstable/x86_64

OBS Notification admin at opensuse.org
Thu Jun 13 03:55:10 UTC 2019


Visit https://build.opensuse.org/package/live_build_log/network:osmocom:latest/openbsc/Debian_Unstable/x86_64

Package network:osmocom:latest/openbsc failed to build in Debian_Unstable/x86_64

Check out the package for editing:
  osc checkout network:osmocom:latest openbsc

Last lines of build log:
[  177s] | configure: exit 0
[  177s] 
[  177s] #                             -*- compilation -*-
[  177s] 4. testsuite.at:23: testing db ...
[  177s] ./testsuite.at:28: $abs_top_builddir/tests/db/db_test
[  177s] --- expout	2019-06-13 03:55:00.500000000 +0000
[  177s] +++ /usr/src/packages/BUILD/openbsc/tests/testsuite.dir/at-groups/4/stdout	2019-06-13 03:55:00.700000000 +0000
[  177s] @@ -1,4 +1,6 @@
[  177s]  Testing subscriber database code.
[  177s]  DB: Database initialized.
[  177s] +no tables in statement !
[  177s] +no tables in statement !
[  177s]  DB: Database prepared.
[  177s]  Done
[  177s] 4. testsuite.at:23: 4. db (testsuite.at:23): FAILED (testsuite.at:28)
[  177s] make[1]: *** [debian/rules:30: override_dh_auto_test] Error 1
[  177s] make[1]: Leaving directory '/usr/src/packages/BUILD'
[  177s] make: *** [debian/rules:13: build] Error 2
[  177s] dpkg-buildpackage: error: debian/rules build subprocess returned exit status 2
[  177s] 
[  177s] lamb18 failed "build openbsc_1.2.0.dsc" at Thu Jun 13 03:55:01 UTC 2019.
[  177s] 
[  177s] ### VM INTERACTION START ###
[  180s] [  166.527340] sysrq: SysRq : Power Off
[  180s] [  166.533571] reboot: Power down
[  180s] ### VM INTERACTION END ###
[  180s] 
[  180s] lamb18 failed "build openbsc_1.2.0.dsc" at Thu Jun 13 03:55:05 UTC 2019.
[  180s] 

-- 
Configure notifications at https://build.opensuse.org/user/notifications
openSUSE Build Service (https://build.opensuse.org/)


More information about the gerrit-log mailing list