Build failure of network:osmocom:latest/openbsc in Debian_Unstable/x86_64

OBS Notification admin at opensuse.org
Mon Jun 10 21:28:53 UTC 2019


Visit https://build.opensuse.org/package/live_build_log/network:osmocom:latest/openbsc/Debian_Unstable/x86_64

Package network:osmocom:latest/openbsc failed to build in Debian_Unstable/x86_64

Check out the package for editing:
  osc checkout network:osmocom:latest openbsc

Last lines of build log:
[  162s] | configure: exit 0
[  162s] 
[  162s] #                             -*- compilation -*-
[  162s] 4. testsuite.at:23: testing db ...
[  162s] ./testsuite.at:28: $abs_top_builddir/tests/db/db_test
[  162s] --- expout	2019-06-10 21:28:34.412000000 +0000
[  162s] +++ /usr/src/packages/BUILD/openbsc/tests/testsuite.dir/at-groups/4/stdout	2019-06-10 21:28:34.552000000 +0000
[  162s] @@ -1,4 +1,6 @@
[  162s]  Testing subscriber database code.
[  162s]  DB: Database initialized.
[  162s] +no tables in statement !
[  162s] +no tables in statement !
[  162s]  DB: Database prepared.
[  162s]  Done
[  162s] 4. testsuite.at:23: 4. db (testsuite.at:23): FAILED (testsuite.at:28)
[  163s] make[1]: *** [debian/rules:30: override_dh_auto_test] Error 1
[  163s] make[1]: Leaving directory '/usr/src/packages/BUILD'
[  163s] make: *** [debian/rules:13: build] Error 2
[  163s] dpkg-buildpackage: error: debian/rules build subprocess returned exit status 2
[  163s] 
[  163s] lamb51 failed "build openbsc_1.2.0.dsc" at Mon Jun 10 21:28:35 UTC 2019.
[  163s] 
[  163s] ### VM INTERACTION START ###
[  166s] [  152.324762] sysrq: SysRq : Power Off
[  166s] [  152.333198] reboot: Power down
[  166s] ### VM INTERACTION END ###
[  166s] 
[  166s] lamb51 failed "build openbsc_1.2.0.dsc" at Mon Jun 10 21:28:39 UTC 2019.
[  166s] 

-- 
Configure notifications at https://build.opensuse.org/user/notifications
openSUSE Build Service (https://build.opensuse.org/)


More information about the gerrit-log mailing list