Build failure of network:osmocom:nightly/osmo-msc in Debian_9.0/armv7l

OBS Notification admin at opensuse.org
Wed Jun 5 04:23:24 UTC 2019


Visit https://build.opensuse.org/package/live_build_log/network:osmocom:nightly/osmo-msc/Debian_9.0/armv7l

Package network:osmocom:nightly/osmo-msc failed to build in Debian_9.0/armv7l

Check out the package for editing:
  osc checkout network:osmocom:nightly osmo-msc

Last lines of build log:
[  668s] -DDB NOTICE verify_sms('Expired SMS'): match
[  668s] -DDB NOTICE test_db_sms_get('Empty TP-UD'): success, as expected
[  668s] -DDB NOTICE verify_sms('Empty TP-UD'): match
[  668s] -full talloc report on 'null_context' (total      0 bytes in   1 blocks)
[  668s] +DDB FATAL Failed to create database connection to sqlite3 db ':memory:'; Is the sqlite3 database driver for libdbi installed on this system?
[  668s] +Assert failed rc == 0 db_sms_test.c:541
[  668s] +/usr/src/packages/BUILD/tests/testsuite.dir/at-groups/3/test-source: line 26: 28907 Aborted                 $abs_top_builddir/tests/db_sms/db_sms_test
[  668s] --- expout	2019-06-05 04:23:02.050000000 +0000
[  668s] +++ /usr/src/packages/BUILD/tests/testsuite.dir/at-groups/3/stdout	2019-06-05 04:23:02.080000000 +0000
[  668s] @@ -0,0 +1 @@
[  668s] +backtrace() returned 0 addresses
[  668s] ./testsuite.at:23: exit code was 134, expected 0
[  668s] 3. testsuite.at:19: 3. db_sms_test (testsuite.at:19): FAILED (testsuite.at:23)
[  668s] debian/rules:63: recipe for target 'override_dh_auto_test' failed
[  668s] make[1]: *** [override_dh_auto_test] Error 1
[  668s] make[1]: Leaving directory '/usr/src/packages/BUILD'
[  668s] debian/rules:45: recipe for target 'build' failed
[  668s] make: *** [build] Error 2
[  668s] dpkg-buildpackage: error: debian/rules build gave error exit status 2
[  668s] 
[  668s] armbuild21 failed "build osmo-msc_1.3.1.135.17aa.dsc" at Wed Jun  5 04:23:03 UTC 2019.
[  668s] 
[  668s] ### VM INTERACTION START ###
[  670s] [  649.439871] sysrq: SysRq : Power Off
[  670s] [  649.441262] reboot: Power down
[  671s] ### VM INTERACTION END ###
[  671s] 
[  671s] armbuild21 failed "build osmo-msc_1.3.1.135.17aa.dsc" at Wed Jun  5 04:23:07 UTC 2019.
[  671s] 

-- 
Configure notifications at https://build.opensuse.org/user/notifications
openSUSE Build Service (https://build.opensuse.org/)


More information about the gerrit-log mailing list