Build failure of network:osmocom:nightly/osmo-msc in Raspbian_9.0/armv7l

OBS Notification admin at opensuse.org
Wed Jun 5 04:16:33 UTC 2019


Visit https://build.opensuse.org/package/live_build_log/network:osmocom:nightly/osmo-msc/Raspbian_9.0/armv7l

Package network:osmocom:nightly/osmo-msc failed to build in Raspbian_9.0/armv7l

Check out the package for editing:
  osc checkout network:osmocom:nightly osmo-msc

Last lines of build log:
[  621s] -DDB NOTICE verify_sms('Expired SMS'): match
[  621s] -DDB NOTICE test_db_sms_get('Empty TP-UD'): success, as expected
[  621s] -DDB NOTICE verify_sms('Empty TP-UD'): match
[  621s] -full talloc report on 'null_context' (total      0 bytes in   1 blocks)
[  621s] +DDB FATAL Failed to create database connection to sqlite3 db ':memory:'; Is the sqlite3 database driver for libdbi installed on this system?
[  621s] +Assert failed rc == 0 db_sms_test.c:541
[  621s] +/usr/src/packages/BUILD/tests/testsuite.dir/at-groups/3/test-source: line 26: 29369 Aborted                 $abs_top_builddir/tests/db_sms/db_sms_test
[  621s] --- expout	2019-06-05 04:16:24.865000000 +0000
[  621s] +++ /usr/src/packages/BUILD/tests/testsuite.dir/at-groups/3/stdout	2019-06-05 04:16:24.890000000 +0000
[  621s] @@ -0,0 +1 @@
[  621s] +backtrace() returned 0 addresses
[  621s] ./testsuite.at:23: exit code was 134, expected 0
[  621s] 3. testsuite.at:19: 3. db_sms_test (testsuite.at:19): FAILED (testsuite.at:23)
[  621s] debian/rules:63: recipe for target 'override_dh_auto_test' failed
[  621s] make[1]: *** [override_dh_auto_test] Error 1
[  621s] make[1]: Leaving directory '/usr/src/packages/BUILD'
[  621s] debian/rules:45: recipe for target 'build' failed
[  621s] make: *** [build] Error 2
[  621s] dpkg-buildpackage: error: debian/rules build gave error exit status 2
[  621s] 
[  621s] armbuild22 failed "build osmo-msc_1.3.1.135.17aa.dsc" at Wed Jun  5 04:16:26 UTC 2019.
[  621s] 
[  621s] ### VM INTERACTION START ###
[  623s] [  602.620632] sysrq: SysRq : Power Off
[  623s] [  602.637668] reboot: Power down
[  624s] ### VM INTERACTION END ###
[  624s] 
[  624s] armbuild22 failed "build osmo-msc_1.3.1.135.17aa.dsc" at Wed Jun  5 04:16:30 UTC 2019.
[  624s] 

-- 
Configure notifications at https://build.opensuse.org/user/notifications
openSUSE Build Service (https://build.opensuse.org/)


More information about the gerrit-log mailing list