Build failure of network:osmocom:nightly/osmo-msc in Raspbian_9.0/armv7l

OBS Notification admin at opensuse.org
Tue Jun 4 12:07:29 UTC 2019


Visit https://build.opensuse.org/package/live_build_log/network:osmocom:nightly/osmo-msc/Raspbian_9.0/armv7l

Package network:osmocom:nightly/osmo-msc failed to build in Raspbian_9.0/armv7l

Check out the package for editing:
  osc checkout network:osmocom:nightly osmo-msc

Last lines of build log:
[  671s] | #define HAVE_STDINT_H 1
[  671s] | #define HAVE_UNISTD_H 1
[  671s] | #define HAVE_DLFCN_H 1
[  671s] | #define LT_OBJDIR ".libs/"
[  671s] | #define HAVE_LIBSCTP 1
[  671s] | #define BUILD_SMPP 1
[  671s] | #define BUILD_IU 1
[  671s] | #define STDC_HEADERS 1
[  671s] | #define HAVE_DBI_DBD_H 1
[  671s] | #define HAVE_TM_GMTOFF_IN_TM 1
[  671s] | 
[  671s] | configure: exit 0
[  671s] 
[  671s] debian/rules:63: recipe for target 'override_dh_auto_test' failed
[  671s] make[1]: *** [override_dh_auto_test] Error 1
[  671s] make[1]: Leaving directory '/usr/src/packages/BUILD'
[  671s] debian/rules:45: recipe for target 'build' failed
[  671s] make: *** [build] Error 2
[  671s] dpkg-buildpackage: error: debian/rules build gave error exit status 2
[  671s] 
[  671s] armbuild21 failed "build osmo-msc_1.3.1.133.9d61.dsc" at Tue Jun  4 12:07:21 UTC 2019.
[  671s] 
[  671s] ### VM INTERACTION START ###
[  673s] [  652.871242] sysrq: SysRq : Power Off
[  673s] [  652.886152] reboot: Power down
[  674s] ### VM INTERACTION END ###
[  674s] 
[  674s] armbuild21 failed "build osmo-msc_1.3.1.133.9d61.dsc" at Tue Jun  4 12:07:25 UTC 2019.
[  674s] 

-- 
Configure notifications at https://build.opensuse.org/user/notifications
openSUSE Build Service (https://build.opensuse.org/)


More information about the gerrit-log mailing list