Build failure of network:osmocom:nightly/osmo-msc in xUbuntu_19.04/x86_64

OBS Notification admin at opensuse.org
Wed Jun 5 03:11:41 UTC 2019


Visit https://build.opensuse.org/package/live_build_log/network:osmocom:nightly/osmo-msc/xUbuntu_19.04/x86_64

Package network:osmocom:nightly/osmo-msc failed to build in xUbuntu_19.04/x86_64

Check out the package for editing:
  osc checkout network:osmocom:nightly osmo-msc

Last lines of build log:
[  486s] -DDB NOTICE verify_sms('Truncated TP-UD (200 septets, 7-bit encoding)'): TP-User-Data mismatch
[  486s] -DDB NOTICE test_db_sms_get('Truncated TP-UD (255 octets, 8-bit encoding)'): success, as expected
[  486s] -DDB NOTICE verify_sms('Truncated TP-UD (255 octets, 8-bit encoding)'): TP-User-Data mismatch
[  486s] -DDB NOTICE test_db_sms_get('Same MSISDN #1'): failure, as expected
[  486s] -DDB NOTICE test_db_sms_get('Same MSISDN #2'): failure, as expected
[  486s] -DDB NOTICE test_db_sms_get('Expired SMS'): unexpected result
[  486s] -DDB NOTICE verify_sms('Expired SMS'): match
[  486s] -DDB NOTICE test_db_sms_get('Empty TP-UD'): success, as expected
[  486s] -DDB NOTICE verify_sms('Empty TP-UD'): match
[  486s] -full talloc report on 'null_context' (total      0 bytes in   1 blocks)
[  486s] +DDB FATAL Failed to create database connection to sqlite3 db ':memory:'; Is the sqlite3 database driver for libdbi installed on this system?
[  486s] +Assert failed rc == 0 db_sms_test.c:541
[  486s] +/usr/src/packages/BUILD/tests/testsuite.dir/at-groups/3/test-source: line 15: 32359 Aborted                 $abs_top_builddir/tests/db_sms/db_sms_test
[  486s] ./testsuite.at:23: exit code was 134, expected 0
[  486s] 3. testsuite.at:19: 3. db_sms_test (testsuite.at:19): FAILED (testsuite.at:23)
[  486s] make[1]: *** [debian/rules:63: override_dh_auto_test] Error 1
[  486s] make[1]: Leaving directory '/usr/src/packages/BUILD'
[  486s] make: *** [debian/rules:45: build] Error 2
[  486s] dpkg-buildpackage: error: debian/rules build subprocess returned exit status 2
[  486s] 
[  486s] lamb55 failed "build osmo-msc_1.3.1.135.17aa.dsc" at Wed Jun  5 03:11:22 UTC 2019.
[  486s] 
[  486s] ### VM INTERACTION START ###
[  489s] [  459.576399] sysrq: SysRq : Power Off
[  489s] [  459.661125] reboot: Power down
[  489s] ### VM INTERACTION END ###
[  489s] 
[  489s] lamb55 failed "build osmo-msc_1.3.1.135.17aa.dsc" at Wed Jun  5 03:11:26 UTC 2019.
[  489s] 

-- 
Configure notifications at https://build.opensuse.org/user/notifications
openSUSE Build Service (https://build.opensuse.org/)


More information about the gerrit-log mailing list