Build failure of network:osmocom:nightly/osmo-msc in xUbuntu_19.04/x86_64

OBS Notification admin at opensuse.org
Tue Jun 4 07:52:51 UTC 2019


Visit https://build.opensuse.org/package/live_build_log/network:osmocom:nightly/osmo-msc/xUbuntu_19.04/x86_64

Package network:osmocom:nightly/osmo-msc failed to build in xUbuntu_19.04/x86_64

Check out the package for editing:
  osc checkout network:osmocom:nightly osmo-msc

Last lines of build log:
[  344s] | #define HAVE_STRINGS_H 1
[  344s] | #define HAVE_INTTYPES_H 1
[  344s] | #define HAVE_STDINT_H 1
[  344s] | #define HAVE_UNISTD_H 1
[  344s] | #define HAVE_DLFCN_H 1
[  344s] | #define LT_OBJDIR ".libs/"
[  344s] | #define HAVE_LIBSCTP 1
[  344s] | #define BUILD_SMPP 1
[  344s] | #define BUILD_IU 1
[  344s] | #define STDC_HEADERS 1
[  344s] | #define HAVE_DBI_DBD_H 1
[  344s] | #define HAVE_TM_GMTOFF_IN_TM 1
[  344s] | 
[  344s] | configure: exit 0
[  344s] 
[  344s] make[1]: *** [debian/rules:63: override_dh_auto_test] Error 1
[  344s] make[1]: Leaving directory '/usr/src/packages/BUILD'
[  344s] make: *** [debian/rules:45: build] Error 2
[  344s] dpkg-buildpackage: error: debian/rules build subprocess returned exit status 2
[  344s] 
[  344s] lamb72 failed "build osmo-msc_1.3.1.133.9d61.dsc" at Tue Jun  4 07:52:30 UTC 2019.
[  344s] 
[  344s] ### VM INTERACTION START ###
[  346s] [  332.248421] sysrq: SysRq : Power Off
[  346s] [  332.254931] reboot: Power down
[  346s] ### VM INTERACTION END ###
[  346s] 
[  346s] lamb72 failed "build osmo-msc_1.3.1.133.9d61.dsc" at Tue Jun  4 07:52:34 UTC 2019.
[  346s] 

-- 
Configure notifications at https://build.opensuse.org/user/notifications
openSUSE Build Service (https://build.opensuse.org/)


More information about the gerrit-log mailing list