Build failure of network:osmocom:nightly/osmo-msc in Debian_Unstable/x86_64

OBS Notification admin at opensuse.org
Tue Jun 4 17:31:29 UTC 2019


Visit https://build.opensuse.org/package/live_build_log/network:osmocom:nightly/osmo-msc/Debian_Unstable/x86_64

Package network:osmocom:nightly/osmo-msc failed to build in Debian_Unstable/x86_64

Check out the package for editing:
  osc checkout network:osmocom:nightly osmo-msc

Last lines of build log:
[  397s] | #define HAVE_STRINGS_H 1
[  397s] | #define HAVE_INTTYPES_H 1
[  397s] | #define HAVE_STDINT_H 1
[  397s] | #define HAVE_UNISTD_H 1
[  397s] | #define HAVE_DLFCN_H 1
[  397s] | #define LT_OBJDIR ".libs/"
[  397s] | #define HAVE_LIBSCTP 1
[  397s] | #define BUILD_SMPP 1
[  397s] | #define BUILD_IU 1
[  397s] | #define STDC_HEADERS 1
[  397s] | #define HAVE_DBI_DBD_H 1
[  397s] | #define HAVE_TM_GMTOFF_IN_TM 1
[  397s] | 
[  397s] | configure: exit 0
[  397s] 
[  397s] make[1]: *** [debian/rules:63: override_dh_auto_test] Error 1
[  397s] make[1]: Leaving directory '/usr/src/packages/BUILD'
[  397s] make: *** [debian/rules:45: build] Error 2
[  397s] dpkg-buildpackage: error: debian/rules build subprocess returned exit status 2
[  397s] 
[  397s] lamb24 failed "build osmo-msc_1.3.1.133.9d61.dsc" at Tue Jun  4 17:31:13 UTC 2019.
[  397s] 
[  397s] ### VM INTERACTION START ###
[  400s] [  381.778623] sysrq: SysRq : Power Off
[  400s] [  381.794831] reboot: Power down
[  400s] ### VM INTERACTION END ###
[  400s] 
[  400s] lamb24 failed "build osmo-msc_1.3.1.133.9d61.dsc" at Tue Jun  4 17:31:18 UTC 2019.
[  400s] 

-- 
Configure notifications at https://build.opensuse.org/user/notifications
openSUSE Build Service (https://build.opensuse.org/)


More information about the gerrit-log mailing list