Build failure of network:osmocom:nightly/osmo-msc in Debian_Unstable/x86_64

OBS Notification admin at opensuse.org
Tue Jun 4 07:56:17 UTC 2019


Visit https://build.opensuse.org/package/live_build_log/network:osmocom:nightly/osmo-msc/Debian_Unstable/x86_64

Package network:osmocom:nightly/osmo-msc failed to build in Debian_Unstable/x86_64

Check out the package for editing:
  osc checkout network:osmocom:nightly osmo-msc

Last lines of build log:
[  554s] -DDB NOTICE verify_sms('Truncated TP-UD (200 septets, 7-bit encoding)'): TP-User-Data mismatch (diff=-65/256)
[  554s] -DDB NOTICE test_db_sms_get('Truncated TP-UD (255 octets, 8-bit encoding)'): success, as expected
[  554s] -DDB NOTICE verify_sms('Truncated TP-UD (255 octets, 8-bit encoding)'): TP-User-Data mismatch (diff=-16896/256)
[  554s] -DDB NOTICE test_db_sms_get('Same MSISDN #1'): failure, as expected
[  554s] -DDB NOTICE test_db_sms_get('Same MSISDN #2'): failure, as expected
[  554s] -DDB NOTICE test_db_sms_get('Expired SMS'): unexpected result
[  554s] -DDB NOTICE verify_sms('Expired SMS'): match
[  554s] -DDB NOTICE test_db_sms_get('Empty TP-UD'): success, as expected
[  554s] -DDB NOTICE verify_sms('Empty TP-UD'): match
[  554s] -full talloc report on 'null_context' (total      0 bytes in   1 blocks)
[  554s] +DDB FATAL Failed to create database connection to sqlite3 db ':memory:'; Is the sqlite3 database driver for libdbi installed on this system?
[  554s] +Assert failed rc == 0 db_sms_test.c:543
[  554s] +/usr/src/packages/BUILD/tests/testsuite.dir/at-groups/3/test-source: line 15: 31068 Aborted                 $abs_top_builddir/tests/db_sms/db_sms_test
[  554s] ./testsuite.at:23: exit code was 134, expected 0
[  554s] 3. testsuite.at:19: 3. db_sms_test (testsuite.at:19): FAILED (testsuite.at:23)
[  554s] make[1]: *** [debian/rules:63: override_dh_auto_test] Error 1
[  554s] make[1]: Leaving directory '/usr/src/packages/BUILD'
[  554s] make: *** [debian/rules:45: build] Error 2
[  554s] dpkg-buildpackage: error: debian/rules build subprocess returned exit status 2
[  554s] 
[  554s] lamb53 failed "build osmo-msc_1.3.1.133.9d61.dsc" at Tue Jun  4 07:56:09 UTC 2019.
[  554s] 
[  554s] ### VM INTERACTION START ###
[  556s] [  503.402385] sysrq: SysRq : Power Off
[  556s] [  503.418490] reboot: Power down
[  556s] ### VM INTERACTION END ###
[  556s] 
[  556s] lamb53 failed "build osmo-msc_1.3.1.133.9d61.dsc" at Tue Jun  4 07:56:12 UTC 2019.
[  556s] 

-- 
Configure notifications at https://build.opensuse.org/user/notifications
openSUSE Build Service (https://build.opensuse.org/)


More information about the gerrit-log mailing list