Build failure of network:osmocom:latest/openbsc in Debian_Testing/x86_64

OBS Notification admin at opensuse.org
Mon Jun 3 15:27:59 UTC 2019


Visit https://build.opensuse.org/package/live_build_log/network:osmocom:latest/openbsc/Debian_Testing/x86_64

Package network:osmocom:latest/openbsc failed to build in Debian_Testing/x86_64

Check out the package for editing:
  osc checkout network:osmocom:latest openbsc

Last lines of build log:
[  248s] | configure: exit 0
[  248s] 
[  248s] #                             -*- compilation -*-
[  248s] 4. testsuite.at:23: testing db ...
[  248s] ./testsuite.at:28: $abs_top_builddir/tests/db/db_test
[  248s] --- expout	2019-06-03 15:27:41.213881439 +0000
[  248s] +++ /usr/src/packages/BUILD/openbsc/tests/testsuite.dir/at-groups/4/stdout	2019-06-03 15:27:41.433881444 +0000
[  248s] @@ -1,4 +1,6 @@
[  248s]  Testing subscriber database code.
[  248s]  DB: Database initialized.
[  248s] +no tables in statement !
[  248s] +no tables in statement !
[  248s]  DB: Database prepared.
[  248s]  Done
[  248s] 4. testsuite.at:23: 4. db (testsuite.at:23): FAILED (testsuite.at:28)
[  248s] make[1]: *** [debian/rules:30: override_dh_auto_test] Error 1
[  248s] make[1]: Leaving directory '/usr/src/packages/BUILD'
[  248s] make: *** [debian/rules:13: build] Error 2
[  248s] dpkg-buildpackage: error: debian/rules build subprocess returned exit status 2
[  248s] 
[  248s] cloud117 failed "build openbsc_1.2.0.dsc" at Mon Jun  3 15:27:43 UTC 2019.
[  248s] 
[  248s] ### VM INTERACTION START ###
[  251s] [  213.747634] sysrq: SysRq : Power Off
[  251s] [  213.756757] reboot: Power down
[  253s] ### VM INTERACTION END ###
[  253s] 
[  253s] cloud117 failed "build openbsc_1.2.0.dsc" at Mon Jun  3 15:27:48 UTC 2019.
[  253s] 

-- 
Configure notifications at https://build.opensuse.org/user/notifications
openSUSE Build Service (https://build.opensuse.org/)


More information about the gerrit-log mailing list