Build failure of network:osmocom:latest/openbsc in Debian_Testing/x86_64

OBS Notification admin at opensuse.org
Sat Jun 1 22:02:45 UTC 2019


Visit https://build.opensuse.org/package/live_build_log/network:osmocom:latest/openbsc/Debian_Testing/x86_64

Package network:osmocom:latest/openbsc failed to build in Debian_Testing/x86_64

Check out the package for editing:
  osc checkout network:osmocom:latest openbsc

Last lines of build log:
[  130s] | #define HAVE_MEMORY_H 1
[  130s] | #define HAVE_STRINGS_H 1
[  130s] | #define HAVE_INTTYPES_H 1
[  130s] | #define HAVE_STDINT_H 1
[  130s] | #define HAVE_UNISTD_H 1
[  130s] | #define HAVE_DLFCN_H 1
[  130s] | #define LT_OBJDIR ".libs/"
[  130s] | #define BUILD_SMPP 1
[  130s] | #define STDC_HEADERS 1
[  130s] | #define HAVE_DBI_DBD_H 1
[  130s] | #define HAVE_PCAP_PCAP_H 1
[  130s] | #define HAVE_TM_GMTOFF_IN_TM 1
[  130s] | 
[  130s] | configure: exit 0
[  130s] 
[  130s] make[1]: *** [debian/rules:30: override_dh_auto_test] Error 1
[  130s] make[1]: Leaving directory '/usr/src/packages/BUILD'
[  130s] make: *** [debian/rules:13: build] Error 2
[  130s] dpkg-buildpackage: error: debian/rules build subprocess returned exit status 2
[  130s] 
[  130s] sheep83 failed "build openbsc_1.2.0.dsc" at Sat Jun  1 22:02:25 UTC 2019.
[  130s] 
[  130s] ### VM INTERACTION START ###
[  133s] [  122.621684] sysrq: SysRq : Power Off
[  133s] [  122.636126] reboot: Power down
[  133s] ### VM INTERACTION END ###
[  133s] 
[  133s] sheep83 failed "build openbsc_1.2.0.dsc" at Sat Jun  1 22:02:29 UTC 2019.
[  133s] 

-- 
Configure notifications at https://build.opensuse.org/user/notifications
openSUSE Build Service (https://build.opensuse.org/)


More information about the gerrit-log mailing list