Build failure of network:osmocom:nightly/osmo-gsm-manuals-debian8-jessie in xUbuntu_16.04/i586

OBS Notification admin at opensuse.org
Mon Jul 29 02:35:45 UTC 2019


Visit https://build.opensuse.org/package/live_build_log/network:osmocom:nightly/osmo-gsm-manuals-debian8-jessie/xUbuntu_16.04/i586

Package network:osmocom:nightly/osmo-gsm-manuals-debian8-jessie failed to build in xUbuntu_16.04/i586

Check out the package for editing:
  osc checkout network:osmocom:nightly osmo-gsm-manuals-debian8-jessie

Last lines of build log:
[  187s] asciidoc -v -f ../build/mscgen-filter.conf -f ../build/diag-filter.conf -f ../build/docinfo-releaseinfo.conf -f ../build/python2-filter.conf -a srcdir='.' -a commondir='../common' test-usermanual.adoc > test-usermanual.check 2>&1
[  216s] # Make absolutely sure that the %.check target is updated.
[  216s] touch test-usermanual.check
[  216s] # Do print the WARNING output but return error if any was found
[  216s] # (grep -v would omit the WARNING output from the log).
[  216s] asciidoc: WARNING: mgcp_extension_osmux.adoc: line 2: section title out of sequence: expected level 1, got level 2
[  216s] ../build/Makefile.asciidoc.inc:87: recipe for target 'test-usermanual.check' failed
[  216s] make[3]: *** [test-usermanual.check] Error 1
[  216s] make[3]: Leaving directory '/usr/src/packages/BUILD/tests'
[  216s] Makefile:438: recipe for target 'check-recursive' failed
[  216s] make[2]: *** [check-recursive] Error 1
[  216s] make[2]: Leaving directory '/usr/src/packages/BUILD'
[  216s] Makefile:729: recipe for target 'check' failed
[  216s] make[1]: *** [check] Error 2
[  216s] make[1]: Leaving directory '/usr/src/packages/BUILD'
[  216s] dh_auto_test: make -j1 check returned exit code 2
[  216s] debian/rules:5: recipe for target 'binary' failed
[  216s] make: *** [binary] Error 2
[  216s] dpkg-buildpackage: error: fakeroot debian/rules binary gave error exit status 2
[  216s] 
[  216s] lamb04 failed "build osmo-gsm-manuals-dev_0.1.1.6.a20f.dsc" at Mon Jul 29 02:35:31 UTC 2019.
[  216s] 
[  216s] ### VM INTERACTION START ###
[  219s] [  206.749620] sysrq: SysRq : Power Off
[  219s] [  206.757251] reboot: Power down
[  219s] ### VM INTERACTION END ###
[  219s] 
[  219s] lamb04 failed "build osmo-gsm-manuals-dev_0.1.1.6.a20f.dsc" at Mon Jul 29 02:35:35 UTC 2019.
[  219s] 

-- 
Configure notifications at https://build.opensuse.org/user/notifications
openSUSE Build Service (https://build.opensuse.org/)


More information about the gerrit-log mailing list