Build failure of network:osmocom:nightly/osmo-gsm-manuals in Raspbian_10/armv7l

OBS Notification admin at opensuse.org
Sun Jul 28 07:29:09 UTC 2019


Visit https://build.opensuse.org/package/live_build_log/network:osmocom:nightly/osmo-gsm-manuals/Raspbian_10/armv7l

Package network:osmocom:nightly/osmo-gsm-manuals failed to build in Raspbian_10/armv7l

Check out the package for editing:
  osc checkout network:osmocom:nightly osmo-gsm-manuals

Last lines of build log:
[  648s] asciidoc: control_if.adoc: line 131: evaluating: {counter2:target-number}
[  648s] asciidoc: control_if.adoc: line 131: evaluating: {set2:target:test-usermanual__53.png}
[  648s] asciidoc: control_if.adoc: line 136: filtering: "/usr/bin/python2" "./build/filter-wrapper.py" mscgen -o "/usr/src/packages/BUILD/tests/test-usermanual__53.png" -Tpng -
[  648s] asciidoc: control_if.adoc: line 136: evaluating: {counter:figure-number}
[  648s] asciidoc: control_if.adoc: line 152: evaluating: {counter:table-number}
[  648s] asciidoc: include: /usr/src/packages/BUILD/common/chapters/mncc.adoc
[  648s] asciidoc: test-usermanual.adoc: line 31: reading: /usr/src/packages/BUILD/common/chapters/mncc.adoc
[  649s] asciidoc: include: /usr/src/packages/BUILD/common/chapters/bts.adoc
[  649s] asciidoc: test-usermanual.adoc: line 32: reading: /usr/src/packages/BUILD/common/chapters/bts.adoc
[  650s] asciidoc: bts.adoc: line 305: evaluating: {counter:table-number}
[  650s] make[3]: *** [../build/Makefile.asciidoc.inc:69: test-usermanual.pdf] Error 1
[  650s] make[3]: Leaving directory '/usr/src/packages/BUILD/tests'
[  650s] make[2]: *** [Makefile:438: all-recursive] Error 1
[  650s] make[2]: Leaving directory '/usr/src/packages/BUILD'
[  650s] make[1]: *** [Makefile:362: all] Error 2
[  650s] make[1]: Leaving directory '/usr/src/packages/BUILD'
[  650s] dh_auto_build: make -j1 returned exit code 2
[  650s] make: *** [debian/rules:5: binary] Error 2
[  650s] dpkg-buildpackage: error: fakeroot debian/rules binary subprocess returned exit status 2
[  650s] 
[  650s] obs-arm-5 failed "build osmo-gsm-manuals-dev_0.1.1.5.abad.dsc" at Sun Jul 28 07:28:54 UTC 2019.
[  650s] 
[  650s] ### VM INTERACTION START ###
[  653s] [  616.998720] sysrq: SysRq : Power Off
[  653s] [  617.011072] reboot: Power down
[  654s] ### VM INTERACTION END ###
[  654s] 
[  654s] obs-arm-5 failed "build osmo-gsm-manuals-dev_0.1.1.5.abad.dsc" at Sun Jul 28 07:28:58 UTC 2019.
[  654s] 

-- 
Configure notifications at https://build.opensuse.org/user/notifications
openSUSE Build Service (https://build.opensuse.org/)


More information about the gerrit-log mailing list