Build failure of network:osmocom:nightly/limesuite in Raspbian_10/armv7l

OBS Notification admin at opensuse.org
Sun Jul 28 07:17:05 UTC 2019


Visit https://build.opensuse.org/package/live_build_log/network:osmocom:nightly/limesuite/Raspbian_10/armv7l

Package network:osmocom:nightly/limesuite failed to build in Raspbian_10/armv7l

Check out the package for editing:
  osc checkout network:osmocom:nightly limesuite

Last lines of build log:
[  232s] /usr/bin/ld: libLimeSuite.so.19.04.0: undefined reference to `__atomic_load_8'
[  232s] /usr/bin/ld: libLimeSuite.so.19.04.0: undefined reference to `__atomic_store_8'
[  232s] collect2: error: ld returned 1 exit status
[  232s] make[3]: *** [src/CMakeFiles/boardEmulator.dir/build.make:89: src/boardEmulator] Error 1
[  232s] make[3]: Leaving directory '/usr/src/packages/BUILD/obj-arm-linux-gnueabihf'
[  232s] make[2]: *** [CMakeFiles/Makefile2:216: src/CMakeFiles/boardEmulator.dir/all] Error 2
[  244s] [ 43%] Linking CXX static library liboglGraph.a
[  244s] cd /usr/src/packages/BUILD/obj-arm-linux-gnueabihf/src/oglGraph && /usr/bin/cmake -P CMakeFiles/oglGraph.dir/cmake_clean_target.cmake
[  244s] cd /usr/src/packages/BUILD/obj-arm-linux-gnueabihf/src/oglGraph && /usr/bin/cmake -E cmake_link_script CMakeFiles/oglGraph.dir/link.txt --verbose=1
[  244s] /usr/bin/ar qc liboglGraph.a  CMakeFiles/oglGraph.dir/dlgMarkers.cpp.o CMakeFiles/oglGraph.dir/GLFont.cpp.o CMakeFiles/oglGraph.dir/OpenGLGraph.cpp.o CMakeFiles/oglGraph.dir/glew/glew.c.o
[  244s] /usr/bin/ranlib liboglGraph.a
[  244s] make[3]: Leaving directory '/usr/src/packages/BUILD/obj-arm-linux-gnueabihf'
[  244s] [ 43%] Built target oglGraph
[  244s] make[2]: Leaving directory '/usr/src/packages/BUILD/obj-arm-linux-gnueabihf'
[  244s] make[1]: *** [Makefile:133: all] Error 2
[  244s] make[1]: Leaving directory '/usr/src/packages/BUILD/obj-arm-linux-gnueabihf'
[  244s] dh_auto_build: cd obj-arm-linux-gnueabihf && make -j4 returned exit code 2
[  244s] make: *** [debian/rules:28: binary] Error 2
[  244s] dpkg-buildpackage: error: fakeroot debian/rules binary subprocess returned exit status 2
[  244s] 
[  244s] armbuild21 failed "build limesuite_19.04.0-1.dsc" at Sun Jul 28 07:17:01 UTC 2019.
[  244s] 
[  244s] ### VM INTERACTION START ###
[  247s] [  226.393918] sysrq: SysRq : Power Off
[  248s] [  226.447511] reboot: Power down
[  248s] ### VM INTERACTION END ###
[  248s] 
[  248s] armbuild21 failed "build limesuite_19.04.0-1.dsc" at Sun Jul 28 07:17:04 UTC 2019.
[  248s] 

-- 
Configure notifications at https://build.opensuse.org/user/notifications
openSUSE Build Service (https://build.opensuse.org/)


More information about the gerrit-log mailing list