Build failure of network:osmocom:nightly/libosmo-netif in Debian_9.0/i586

OBS Notification admin at opensuse.org
Sun Jul 14 02:44:34 UTC 2019


Visit https://build.opensuse.org/package/live_build_log/network:osmocom:nightly/libosmo-netif/Debian_9.0/i586

Package network:osmocom:nightly/libosmo-netif failed to build in Debian_9.0/i586

Check out the package for editing:
  osc checkout network:osmocom:nightly libosmo-netif

Last lines of build log:
[  170s] | #define HAVE_DLFCN_H 1
[  170s] | #define LT_OBJDIR ".libs/"
[  170s] | #define STDC_HEADERS 1
[  170s] | #define HAVE_EXECINFO_H 1
[  170s] | #define HAVE_SYS_SELECT_H 1
[  170s] | #define HAVE_SYS_SOCKET_H 1
[  170s] | #define HAVE_SYSLOG_H 1
[  170s] | #define HAVE_CTYPE_H 1
[  170s] | #define HAVE_LIBSCTP 1
[  170s] | #define HAVE_PCAP_H 1
[  170s] | 
[  170s] | configure: exit 0
[  170s] 
[  170s] debian/rules:27: recipe for target 'override_dh_auto_test' failed
[  170s] make[1]: *** [override_dh_auto_test] Error 1
[  170s] make[1]: Leaving directory '/usr/src/packages/BUILD'
[  170s] debian/rules:13: recipe for target 'build' failed
[  170s] make: *** [build] Error 2
[  170s] dpkg-buildpackage: error: debian/rules build gave error exit status 2
[  170s] 
[  170s] lamb25 failed "build libosmo-netif_0.5.0.2.6563.dsc" at Sun Jul 14 02:44:22 UTC 2019.
[  170s] 
[  170s] ### VM INTERACTION START ###
[  172s] [  156.396612] sysrq: SysRq : Power Off
[  172s] [  156.407457] reboot: Power down
[  172s] ### VM INTERACTION END ###
[  172s] 
[  172s] lamb25 failed "build libosmo-netif_0.5.0.2.6563.dsc" at Sun Jul 14 02:44:25 UTC 2019.
[  172s] 

-- 
Configure notifications at https://build.opensuse.org/user/notifications
openSUSE Build Service (https://build.opensuse.org/)


More information about the gerrit-log mailing list