Build failure of network:osmocom:nightly/libosmo-netif in Debian_8.0/x86_64

OBS Notification admin at opensuse.org
Sun Jul 14 02:47:25 UTC 2019


Visit https://build.opensuse.org/package/live_build_log/network:osmocom:nightly/libosmo-netif/Debian_8.0/x86_64

Package network:osmocom:nightly/libosmo-netif failed to build in Debian_8.0/x86_64

Check out the package for editing:
  osc checkout network:osmocom:nightly libosmo-netif

Last lines of build log:
[  109s]  autoreconnecting test step 3 [client OK, server OK], FD reg 1
[  109s]  
[  109s]  autoreconnecting test step 2 [client OK, server OK], FD reg 0
[  109s] +
[  109s] +autoreconnecting test step 1 [client OK, server OK], FD reg 0
[  109s]  connection closed with srv
[  109s]  
[  109s] -autoreconnecting test step 1 [client OK, server NA], FD reg 0
[  109s] +autoreconnecting test step 0 [client OK, server NA], FD reg 0
[  109s]  
[  109s]  non-reconnecting test step 7 [client NA, server OK], FD reg 1
[  109s]  
[  109s] 1. testsuite.at:4: 1. stream_test (testsuite.at:4): FAILED (testsuite.at:8)
[  109s] debian/rules:27: recipe for target 'override_dh_auto_test' failed
[  109s] make[1]: *** [override_dh_auto_test] Error 1
[  109s] make[1]: Leaving directory '/usr/src/packages/BUILD'
[  109s] debian/rules:13: recipe for target 'build' failed
[  109s] make: *** [build] Error 2
[  109s] dpkg-buildpackage: error: debian/rules build gave error exit status 2
[  109s] 
[  109s] lamb54 failed "build libosmo-netif_0.5.0.2.6563.dsc" at Sun Jul 14 02:47:13 UTC 2019.
[  109s] 
[  109s] ### VM INTERACTION START ###
[  110s] Powering off.
[  110s] [   98.299941] reboot: Power down
[  110s] ### VM INTERACTION END ###
[  110s] 
[  110s] lamb54 failed "build libosmo-netif_0.5.0.2.6563.dsc" at Sun Jul 14 02:47:15 UTC 2019.
[  110s] 

-- 
Configure notifications at https://build.opensuse.org/user/notifications
openSUSE Build Service (https://build.opensuse.org/)


More information about the gerrit-log mailing list