Build failure of network:osmocom:latest/openbsc in Raspbian_10/armv7l

OBS Notification admin at opensuse.org
Sat Jul 13 17:11:35 UTC 2019


Visit https://build.opensuse.org/package/live_build_log/network:osmocom:latest/openbsc/Raspbian_10/armv7l

Package network:osmocom:latest/openbsc failed to build in Raspbian_10/armv7l

Check out the package for editing:
  osc checkout network:osmocom:latest openbsc

Last lines of build log:
[  251s] | configure: exit 0
[  251s] 
[  251s] #                             -*- compilation -*-
[  251s] 4. testsuite.at:23: testing db ...
[  251s] ./testsuite.at:28: $abs_top_builddir/tests/db/db_test
[  251s] --- expout	2019-07-13 17:11:25.535000000 +0000
[  251s] +++ /usr/src/packages/BUILD/openbsc/tests/testsuite.dir/at-groups/4/stdout	2019-07-13 17:11:25.760000000 +0000
[  251s] @@ -1,4 +1,6 @@
[  251s]  Testing subscriber database code.
[  251s]  DB: Database initialized.
[  251s] +no tables in statement !
[  251s] +no tables in statement !
[  251s]  DB: Database prepared.
[  251s]  Done
[  251s] 4. testsuite.at:23: 4. db (testsuite.at:23): FAILED (testsuite.at:28)
[  251s] make[1]: *** [debian/rules:30: override_dh_auto_test] Error 1
[  251s] make[1]: Leaving directory '/usr/src/packages/BUILD'
[  251s] make: *** [debian/rules:13: build] Error 2
[  251s] dpkg-buildpackage: error: debian/rules build subprocess returned exit status 2
[  251s] 
[  251s] armbuild24 failed "build openbsc_1.2.0.dsc" at Sat Jul 13 17:11:26 UTC 2019.
[  251s] 
[  251s] ### VM INTERACTION START ###
[  254s] [  235.252017] sysrq: SysRq : Power Off
[  254s] [  235.253500] reboot: Power down
[  254s] ### VM INTERACTION END ###
[  254s] 
[  254s] armbuild24 failed "build openbsc_1.2.0.dsc" at Sat Jul 13 17:11:30 UTC 2019.
[  254s] 

-- 
Configure notifications at https://build.opensuse.org/user/notifications
openSUSE Build Service (https://build.opensuse.org/)


More information about the gerrit-log mailing list