Build failure of network:osmocom:latest/openbsc in Debian_10/armv7l

OBS Notification admin at opensuse.org
Sat Jul 13 17:07:34 UTC 2019


Visit https://build.opensuse.org/package/live_build_log/network:osmocom:latest/openbsc/Debian_10/armv7l

Package network:osmocom:latest/openbsc failed to build in Debian_10/armv7l

Check out the package for editing:
  osc checkout network:osmocom:latest openbsc

Last lines of build log:
[  222s] | #define HAVE_MEMORY_H 1
[  222s] | #define HAVE_STRINGS_H 1
[  222s] | #define HAVE_INTTYPES_H 1
[  222s] | #define HAVE_STDINT_H 1
[  222s] | #define HAVE_UNISTD_H 1
[  222s] | #define HAVE_DLFCN_H 1
[  222s] | #define LT_OBJDIR ".libs/"
[  222s] | #define BUILD_SMPP 1
[  222s] | #define STDC_HEADERS 1
[  222s] | #define HAVE_DBI_DBD_H 1
[  222s] | #define HAVE_PCAP_PCAP_H 1
[  222s] | #define HAVE_TM_GMTOFF_IN_TM 1
[  222s] | 
[  222s] | configure: exit 0
[  222s] 
[  222s] make[1]: *** [debian/rules:30: override_dh_auto_test] Error 1
[  222s] make[1]: Leaving directory '/usr/src/packages/BUILD'
[  222s] make: *** [debian/rules:13: build] Error 2
[  222s] dpkg-buildpackage: error: debian/rules build subprocess returned exit status 2
[  222s] 
[  222s] obs-arm-6 failed "build openbsc_1.2.0.dsc" at Sat Jul 13 17:07:14 UTC 2019.
[  222s] 
[  222s] ### VM INTERACTION START ###
[  225s] [  203.469972] sysrq: SysRq : Power Off
[  225s] [  203.502235] reboot: Power down
[  226s] ### VM INTERACTION END ###
[  226s] 
[  226s] obs-arm-6 failed "build openbsc_1.2.0.dsc" at Sat Jul 13 17:07:19 UTC 2019.
[  226s] 

-- 
Configure notifications at https://build.opensuse.org/user/notifications
openSUSE Build Service (https://build.opensuse.org/)


More information about the gerrit-log mailing list