Build failure of network:osmocom:latest/openbsc in Debian_Testing/x86_64

OBS Notification admin at opensuse.org
Sat Jul 13 03:38:59 UTC 2019


Visit https://build.opensuse.org/package/live_build_log/network:osmocom:latest/openbsc/Debian_Testing/x86_64

Package network:osmocom:latest/openbsc failed to build in Debian_Testing/x86_64

Check out the package for editing:
  osc checkout network:osmocom:latest openbsc

Last lines of build log:
[   99s] | configure: exit 0
[   99s] 
[   99s] #                             -*- compilation -*-
[   99s] 4. testsuite.at:23: testing db ...
[   99s] ./testsuite.at:28: $abs_top_builddir/tests/db/db_test
[   99s] --- expout	2019-07-13 03:38:46.410645527 +0000
[   99s] +++ /usr/src/packages/BUILD/openbsc/tests/testsuite.dir/at-groups/4/stdout	2019-07-13 03:38:46.494645525 +0000
[   99s] @@ -1,4 +1,6 @@
[   99s]  Testing subscriber database code.
[   99s]  DB: Database initialized.
[   99s] +no tables in statement !
[   99s] +no tables in statement !
[   99s]  DB: Database prepared.
[   99s]  Done
[   99s] 4. testsuite.at:23: 4. db (testsuite.at:23): FAILED (testsuite.at:28)
[   99s] make[1]: *** [debian/rules:30: override_dh_auto_test] Error 1
[   99s] make[1]: Leaving directory '/usr/src/packages/BUILD'
[   99s] make: *** [debian/rules:13: build] Error 2
[   99s] dpkg-buildpackage: error: debian/rules build subprocess returned exit status 2
[   99s] 
[   99s] build70 failed "build openbsc_1.2.0.dsc" at Sat Jul 13 03:38:47 UTC 2019.
[   99s] 
[   99s] ### VM INTERACTION START ###
[  102s] [   92.752899] sysrq: SysRq : Power Off
[  102s] [   92.754654] reboot: Power down
[  102s] ### VM INTERACTION END ###
[  102s] 
[  102s] build70 failed "build openbsc_1.2.0.dsc" at Sat Jul 13 03:38:50 UTC 2019.
[  102s] 

-- 
Configure notifications at https://build.opensuse.org/user/notifications
openSUSE Build Service (https://build.opensuse.org/)


More information about the gerrit-log mailing list