Build failure of network:osmocom:latest/openbsc in Debian_Testing/x86_64

OBS Notification admin at opensuse.org
Fri Jul 12 10:51:07 UTC 2019


Visit https://build.opensuse.org/package/live_build_log/network:osmocom:latest/openbsc/Debian_Testing/x86_64

Package network:osmocom:latest/openbsc failed to build in Debian_Testing/x86_64

Check out the package for editing:
  osc checkout network:osmocom:latest openbsc

Last lines of build log:
[  798s] | #define HAVE_MEMORY_H 1
[  798s] | #define HAVE_STRINGS_H 1
[  798s] | #define HAVE_INTTYPES_H 1
[  798s] | #define HAVE_STDINT_H 1
[  798s] | #define HAVE_UNISTD_H 1
[  798s] | #define HAVE_DLFCN_H 1
[  798s] | #define LT_OBJDIR ".libs/"
[  798s] | #define BUILD_SMPP 1
[  798s] | #define STDC_HEADERS 1
[  798s] | #define HAVE_DBI_DBD_H 1
[  798s] | #define HAVE_PCAP_PCAP_H 1
[  798s] | #define HAVE_TM_GMTOFF_IN_TM 1
[  798s] | 
[  798s] | configure: exit 0
[  798s] 
[  798s] make[1]: *** [debian/rules:30: override_dh_auto_test] Error 1
[  798s] make[1]: Leaving directory '/usr/src/packages/BUILD'
[  798s] make: *** [debian/rules:13: build] Error 2
[  798s] dpkg-buildpackage: error: debian/rules build subprocess returned exit status 2
[  798s] 
[  798s] lamb59 failed "build openbsc_1.2.0.dsc" at Fri Jul 12 10:50:52 UTC 2019.
[  798s] 
[  798s] ### VM INTERACTION START ###
[  800s] [  736.863631] sysrq: SysRq : Power Off
[  800s] [  736.925166] reboot: Power down
[  801s] ### VM INTERACTION END ###
[  801s] 
[  801s] lamb59 failed "build openbsc_1.2.0.dsc" at Fri Jul 12 10:50:57 UTC 2019.
[  801s] 

-- 
Configure notifications at https://build.opensuse.org/user/notifications
openSUSE Build Service (https://build.opensuse.org/)


More information about the gerrit-log mailing list