Build failure of network:osmocom:nightly/libosmo-netif in xUbuntu_18.10/x86_64

OBS Notification admin at opensuse.org
Thu Jul 11 02:43:08 UTC 2019


Visit https://build.opensuse.org/package/live_build_log/network:osmocom:nightly/libosmo-netif/xUbuntu_18.10/x86_64

Package network:osmocom:nightly/libosmo-netif failed to build in xUbuntu_18.10/x86_64

Check out the package for editing:
  osc checkout network:osmocom:nightly libosmo-netif

Last lines of build log:
[  143s] | #define HAVE_STDINT_H 1
[  143s] | #define HAVE_UNISTD_H 1
[  143s] | #define HAVE_DLFCN_H 1
[  143s] | #define LT_OBJDIR ".libs/"
[  143s] | #define STDC_HEADERS 1
[  143s] | #define HAVE_EXECINFO_H 1
[  143s] | #define HAVE_SYS_SELECT_H 1
[  143s] | #define HAVE_SYS_SOCKET_H 1
[  143s] | #define HAVE_SYSLOG_H 1
[  143s] | #define HAVE_CTYPE_H 1
[  143s] | #define HAVE_LIBSCTP 1
[  143s] | #define HAVE_PCAP_H 1
[  143s] | 
[  143s] | configure: exit 0
[  143s] 
[  143s] make[1]: *** [debian/rules:27: override_dh_auto_test] Error 1
[  143s] make[1]: Leaving directory '/usr/src/packages/BUILD'
[  143s] make: *** [debian/rules:13: build] Error 2
[  143s] dpkg-buildpackage: error: debian/rules build subprocess returned exit status 2
[  143s] 
[  143s] lamb12 failed "build libosmo-netif_0.5.0.1.f0f1.dsc" at Thu Jul 11 02:42:50 UTC 2019.
[  143s] 
[  143s] ### VM INTERACTION START ###
[  146s] [  134.263919] sysrq: SysRq : Power Off
[  146s] [  134.270434] reboot: Power down
[  146s] ### VM INTERACTION END ###
[  146s] 
[  146s] lamb12 failed "build libosmo-netif_0.5.0.1.f0f1.dsc" at Thu Jul 11 02:42:53 UTC 2019.
[  146s] 

-- 
Configure notifications at https://build.opensuse.org/user/notifications
openSUSE Build Service (https://build.opensuse.org/)


More information about the gerrit-log mailing list