Build failure of network:osmocom:nightly/osmo-msc in xUbuntu_18.04/x86_64

OBS Notification admin at opensuse.org
Tue Jul 9 03:09:33 UTC 2019


Visit https://build.opensuse.org/package/live_build_log/network:osmocom:nightly/osmo-msc/xUbuntu_18.04/x86_64

Package network:osmocom:nightly/osmo-msc failed to build in xUbuntu_18.04/x86_64

Check out the package for editing:
  osc checkout network:osmocom:nightly osmo-msc

Last lines of build log:
[  426s] ran_peer.c:374:3: error: expected ';' before 'do'
[  426s]    OSMO_ASSERT(!ctx->conn);
[  426s]    ^
[  426s] Makefile:538: recipe for target 'ran_peer.o' failed
[  426s] make[4]: *** [ran_peer.o] Error 1
[  426s] make[4]: Leaving directory '/usr/src/packages/BUILD/src/libmsc'
[  426s] Makefile:422: recipe for target 'all-recursive' failed
[  426s] make[3]: *** [all-recursive] Error 1
[  426s] make[3]: Leaving directory '/usr/src/packages/BUILD/src'
[  426s] Makefile:462: recipe for target 'all-recursive' failed
[  426s] make[2]: *** [all-recursive] Error 1
[  426s] make[2]: Leaving directory '/usr/src/packages/BUILD'
[  426s] Makefile:394: recipe for target 'all' failed
[  426s] make[1]: *** [all] Error 2
[  426s] make[1]: Leaving directory '/usr/src/packages/BUILD'
[  426s] dh_auto_build: make -j1 returned exit code 2
[  426s] debian/rules:45: recipe for target 'build' failed
[  426s] make: *** [build] Error 2
[  426s] dpkg-buildpackage: error: debian/rules build subprocess returned exit status 2
[  426s] 
[  426s] cloud123 failed "build osmo-msc_1.3.1.175.1c500.dsc" at Tue Jul  9 03:09:17 UTC 2019.
[  426s] 
[  426s] ### VM INTERACTION START ###
[  429s] [  380.954029] sysrq: SysRq : Power Off
[  429s] [  380.972189] reboot: Power down
[  430s] ### VM INTERACTION END ###
[  430s] 
[  430s] cloud123 failed "build osmo-msc_1.3.1.175.1c500.dsc" at Tue Jul  9 03:09:23 UTC 2019.
[  430s] 

-- 
Configure notifications at https://build.opensuse.org/user/notifications
openSUSE Build Service (https://build.opensuse.org/)


More information about the gerrit-log mailing list