Build failure of network:osmocom:nightly/osmo-msc in xUbuntu_18.10/x86_64

OBS Notification admin at opensuse.org
Tue Jul 9 03:08:25 UTC 2019


Visit https://build.opensuse.org/package/live_build_log/network:osmocom:nightly/osmo-msc/xUbuntu_18.10/x86_64

Package network:osmocom:nightly/osmo-msc failed to build in xUbuntu_18.10/x86_64

Check out the package for editing:
  osc checkout network:osmocom:nightly osmo-msc

Last lines of build log:
[  308s] gcc -DHAVE_CONFIG_H -I. -I../..   -I../../include -I../..  -Wdate-time -D_FORTIFY_SOURCE=2 -Wall -I/usr/include/ -I/usr/include/ -I/usr/include/  -I/usr/include/ -I/usr/include/ -I/usr/include/asn1c -I/usr/include/ -I/usr/include/ -I/usr/include/ -I/usr/include/ -I/usr/include/ -I/usr/include/  -g -O2 -fdebug-prefix-map=/usr/src/packages/BUILD=. -fstack-protector-strong -Wformat -Werror=format-security -Werror=implicit -Werror=maybe-uninitialized -Werror=memset-transposed-args -Werror=null-dereference -Werror=sizeof-array-argument -Werror=sizeof-pointer-memaccess -c -o ran_msg_a.o ran_msg_a.c
[  309s] gcc -DHAVE_CONFIG_H -I. -I../..   -I../../include -I../..  -Wdate-time -D_FORTIFY_SOURCE=2 -Wall -I/usr/include/ -I/usr/include/ -I/usr/include/  -I/usr/include/ -I/usr/include/ -I/usr/include/asn1c -I/usr/include/ -I/usr/include/ -I/usr/include/ -I/usr/include/ -I/usr/include/ -I/usr/include/  -g -O2 -fdebug-prefix-map=/usr/src/packages/BUILD=. -fstack-protector-strong -Wformat -Werror=format-security -Werror=implicit -Werror=maybe-uninitialized -Werror=memset-transposed-args -Werror=null-dereference -Werror=sizeof-array-argument -Werror=sizeof-pointer-memaccess -c -o ran_peer.o ran_peer.c
[  309s] In file included from /usr/include/osmocom/core/fsm.h:12,
[  309s]                  from ran_peer.c:25:
[  309s] ran_peer.c: In function 'ran_peer_st_ready':
[  309s] ran_peer.c:374:3: error: expected ';' before 'do'
[  309s]    OSMO_ASSERT(!ctx->conn);
[  309s]    ^~~~~~~~~~~
[  309s] make[4]: *** [Makefile:570: ran_peer.o] Error 1
[  309s] make[4]: Leaving directory '/usr/src/packages/BUILD/src/libmsc'
[  309s] make[3]: *** [Makefile:422: all-recursive] Error 1
[  309s] make[3]: Leaving directory '/usr/src/packages/BUILD/src'
[  309s] make[2]: *** [Makefile:462: all-recursive] Error 1
[  309s] make[2]: Leaving directory '/usr/src/packages/BUILD'
[  309s] make[1]: *** [Makefile:394: all] Error 2
[  309s] make[1]: Leaving directory '/usr/src/packages/BUILD'
[  309s] dh_auto_build: make -j1 returned exit code 2
[  309s] make: *** [debian/rules:45: build] Error 2
[  309s] dpkg-buildpackage: error: debian/rules build subprocess returned exit status 2
[  309s] 
[  309s] lamb11 failed "build osmo-msc_1.3.1.175.1c500.dsc" at Tue Jul  9 03:08:05 UTC 2019.
[  309s] 
[  309s] ### VM INTERACTION START ###
[  312s] [  297.368387] sysrq: SysRq : Power Off
[  312s] [  297.374232] reboot: Power down
[  312s] ### VM INTERACTION END ###
[  312s] 
[  312s] lamb11 failed "build osmo-msc_1.3.1.175.1c500.dsc" at Tue Jul  9 03:08:09 UTC 2019.
[  312s] 

-- 
Configure notifications at https://build.opensuse.org/user/notifications
openSUSE Build Service (https://build.opensuse.org/)


More information about the gerrit-log mailing list