Build failure of network:osmocom:latest/osmo-gsm-manuals in Debian_Unstable/x86_64

OBS Notification admin at opensuse.org
Wed Aug 21 23:30:51 UTC 2019


Visit https://build.opensuse.org/package/live_build_log/network:osmocom:latest/osmo-gsm-manuals/Debian_Unstable/x86_64

Package network:osmocom:latest/osmo-gsm-manuals failed to build in Debian_Unstable/x86_64

Check out the package for editing:
  osc checkout network:osmocom:latest osmo-gsm-manuals

Last lines of build log:
[  299s] asciidoc: control_if.adoc: line 115: evaluating: {set2:target:test-usermanual__53.png}
[  299s] asciidoc: control_if.adoc: line 121: filtering: "/usr/bin/python2" "./build/filter-wrapper.py" mscgen -o "/usr/src/packages/BUILD/tests/test-usermanual__53.png" -Tpng -
[  299s] asciidoc: control_if.adoc: line 131: evaluating: {counter2:target-number}
[  299s] asciidoc: control_if.adoc: line 131: evaluating: {set2:target:test-usermanual__54.png}
[  299s] asciidoc: control_if.adoc: line 136: filtering: "/usr/bin/python2" "./build/filter-wrapper.py" mscgen -o "/usr/src/packages/BUILD/tests/test-usermanual__54.png" -Tpng -
[  299s] asciidoc: include: /usr/src/packages/BUILD/common/chapters/abis.adoc
[  299s] asciidoc: test-usermanual.adoc: line 31: reading: /usr/src/packages/BUILD/common/chapters/abis.adoc
[  299s] asciidoc: include: /usr/src/packages/BUILD/common/chapters/spectrum.adoc
[  299s] asciidoc: test-usermanual.adoc: line 32: reading: /usr/src/packages/BUILD/common/chapters/spectrum.adoc
[  299s] 
[  299s] make[3]: *** [../build/Makefile.asciidoc.inc:69: test-usermanual.pdf] Error 1
[  299s] make[3]: Leaving directory '/usr/src/packages/BUILD/tests'
[  299s] make[2]: *** [Makefile:438: all-recursive] Error 1
[  299s] make[2]: Leaving directory '/usr/src/packages/BUILD'
[  299s] make[1]: *** [Makefile:362: all] Error 2
[  299s] make[1]: Leaving directory '/usr/src/packages/BUILD'
[  299s] dh_auto_build: make -j1 returned exit code 2
[  299s] make: *** [debian/rules:5: binary] Error 255
[  299s] dpkg-buildpackage: error: fakeroot debian/rules binary subprocess returned exit status 2
[  299s] 
[  299s] lamb62 failed "build osmo-gsm-manuals-dev_0.2.0.dsc" at Wed Aug 21 23:30:34 UTC 2019.
[  299s] 
[  299s] ### VM INTERACTION START ###
[  302s] [  285.895177] sysrq: SysRq : Power Off
[  302s] [  285.904283] reboot: Power down
[  303s] ### VM INTERACTION END ###
[  303s] 
[  303s] lamb62 failed "build osmo-gsm-manuals-dev_0.2.0.dsc" at Wed Aug 21 23:30:38 UTC 2019.
[  303s] 

-- 
Configure notifications at https://build.opensuse.org/user/notifications
openSUSE Build Service (https://build.opensuse.org/)


More information about the gerrit-log mailing list