Build failure of network:osmocom:nightly/libosmocore in xUbuntu_16.04/i586

OBS Notification admin at opensuse.org
Sun Oct 1 12:14:28 UTC 2017


Visit https://build.opensuse.org/package/live_build_log/network:osmocom:nightly/libosmocore/xUbuntu_16.04/i586

Package network:osmocom:nightly/libosmocore failed to build in xUbuntu_16.04/i586

Check out the package for editing:
  osc checkout network:osmocom:nightly libosmocore

Last lines of build log:
[  273s] -[..] Encoding / Decoding cycle : OK
[  273s] -[..] Encoding / Decoding cycle : OK
[  273s] -[..] Encoding / Decoding cycle : OK
[  273s] -
[  273s] -[+] Testing: gsm0503_mcs9
[  273s] -[.] Input length  : ret = 606  exp = 606 -> OK
[  273s] -[.] Output length : ret = 1836  exp = 1836 -> OK
[  273s] -[.] Random vector checks:
[  273s] -[..] Encoding / Decoding cycle : OK
[  273s] -[..] Encoding / Decoding cycle : OK
[  273s] -[..] Encoding / Decoding cycle : OK
[  273s] -
[  273s] ./testsuite.at:57: exit code was 132, expected 0
[  273s] 9. testsuite.at:54: 9. conv_gsm0503 (testsuite.at:54): FAILED (testsuite.at:57)
[  273s] debian/rules:26: recipe for target 'override_dh_auto_test' failed
[  273s] make[1]: *** [override_dh_auto_test] Error 1
[  273s] make[1]: Leaving directory '/usr/src/packages/BUILD'
[  273s] debian/rules:15: recipe for target 'build' failed
[  273s] make: *** [build] Error 2
[  273s] dpkg-buildpackage: error: debian/rules build gave error exit status 2
[  273s] 
[  273s] build35 failed "build libosmocore_0.9.6.20171001.dsc" at Sun Oct  1 12:14:22 UTC 2017.
[  273s] 
[  273s] ### VM INTERACTION START ###
[  275s] [  264.644500] reboot: Power down
[  276s] ### VM INTERACTION END ###
[  276s] 
[  276s] build35 failed "build libosmocore_0.9.6.20171001.dsc" at Sun Oct  1 12:14:26 UTC 2017.
[  276s] 

-- 
Configure notifications at https://build.opensuse.org/user/notifications
openSUSE Build Service (https://build.opensuse.org/)


More information about the gerrit-log mailing list