Build failure of network:osmocom:nightly/osmo-trx in xUbuntu_16.04/x86_64

OBS Notification admin at opensuse.org
Thu Jan 26 20:00:23 UTC 2017


Visit https://build.opensuse.org/package/live_build_log/network:osmocom:nightly/osmo-trx/xUbuntu_16.04/x86_64

Package network:osmocom:nightly/osmo-trx failed to build in xUbuntu_16.04/x86_64

Check out the package for editing:
  osc checkout network:osmocom:nightly osmo-trx

Last lines of build log:
[  131s] libtool: compile:  g++ -DHAVE_CONFIG_H -I. -I/usr/src/packages/BUILD -I/usr/src/packages/BUILD/CommonLibs -I/usr/src/packages/BUILD/GSM -I/usr/src/packages/BUILD/sqlite3 -Wdate-time -D_FORTIFY_SOURCE=2 -Wall -O3 -g -ldl -lpthread -g -O2 -fstack-protector-strong -Wformat -Werror=format-security -c Timeval.cpp  -fPIC -DPIC -o .libs/Timeval.o
[  132s] /bin/bash /usr/src/packages/BUILD/libtool  --tag=CXX   --mode=compile g++ -DHAVE_CONFIG_H -I. -I/usr/src/packages/BUILD   -I/usr/src/packages/BUILD/CommonLibs -I/usr/src/packages/BUILD/GSM -I/usr/src/packages/BUILD/sqlite3 -Wdate-time -D_FORTIFY_SOURCE=2 -Wall -O3 -g -ldl -lpthread -g -O2 -fPIE -fstack-protector-strong -Wformat -Werror=format-security -c -o Reporting.lo Reporting.cpp
[  132s] libtool: compile:  g++ -DHAVE_CONFIG_H -I. -I/usr/src/packages/BUILD -I/usr/src/packages/BUILD/CommonLibs -I/usr/src/packages/BUILD/GSM -I/usr/src/packages/BUILD/sqlite3 -Wdate-time -D_FORTIFY_SOURCE=2 -Wall -O3 -g -ldl -lpthread -g -O2 -fstack-protector-strong -Wformat -Werror=format-security -c Reporting.cpp  -fPIC -DPIC -o .libs/Reporting.o
[  132s] In file included from Reporting.h:29:0,
[  132s]                  from Reporting.cpp:26:
[  132s] ./sqlite3util.h:4:21: fatal error: sqlite3.h: No such file or directory
[  132s] compilation terminated.
[  132s] Makefile:647: recipe for target 'Reporting.lo' failed
[  132s] make[3]: *** [Reporting.lo] Error 1
[  132s] make[3]: Leaving directory '/usr/src/packages/BUILD/CommonLibs'
[  132s] Makefile:499: recipe for target 'all-recursive' failed
[  132s] make[2]: *** [all-recursive] Error 1
[  132s] make[2]: Leaving directory '/usr/src/packages/BUILD'
[  132s] Makefile:430: recipe for target 'all' failed
[  132s] make[1]: *** [all] Error 2
[  132s] make[1]: Leaving directory '/usr/src/packages/BUILD'
[  132s] dh_auto_build: make -j1 returned exit code 2
[  132s] debian/rules:6: recipe for target 'build' failed
[  132s] make: *** [build] Error 2
[  132s] dpkg-buildpackage: error: debian/rules build gave error exit status 2
[  132s] 
[  132s] lamb15 failed "build osmo-trx_0.1.9.20170126.dsc" at Thu Jan 26 20:00:07 UTC 2017.
[  132s] 
[  132s] ### VM INTERACTION START ###
[  135s] [  120.817247] reboot: Power down
[  135s] ### VM INTERACTION END ###
[  135s] 
[  135s] lamb15 failed "build osmo-trx_0.1.9.20170126.dsc" at Thu Jan 26 20:00:11 UTC 2017.
[  135s] 

-- 
Configure notifications at https://build.opensuse.org/user/notifications
openSUSE Build Service (https://build.opensuse.org/)


More information about the gerrit-log mailing list