Build failure of network:osmocom:nightly/libosmo-abis in xUbuntu_16.04/i586

OBS Notification admin at opensuse.org
Tue Jan 24 13:26:23 UTC 2017


Visit https://build.opensuse.org/package/live_build_log/network:osmocom:nightly/libosmo-abis/xUbuntu_16.04/i586

Package network:osmocom:nightly/libosmo-abis failed to build in xUbuntu_16.04/i586

Check out the package for editing:
  osc checkout network:osmocom:nightly libosmo-abis

Last lines of build log:
[  265s] /bin/bash ../libtool  --tag=CC   --mode=link gcc -Wall -g -I/usr/include/ -I/usr/include/  -g -O2 -fPIE -fstack-protector-strong -Wformat -Werror=format-security  -Wl,-Bsymbolic-functions -fPIE -pie -Wl,-z,relro -Wl,-z,now -o e1inp_ipa_bsc_test e1inp_ipa_bsc_test.o ../src/libosmoabis.la -ltalloc -losmocore -ltalloc -losmogsm -losmocore 
[  266s] libtool: link: gcc -Wall -g -I/usr/include/ -I/usr/include/ -g -O2 -fPIE -fstack-protector-strong -Wformat -Werror=format-security -Wl,-Bsymbolic-functions -fPIE -pie -Wl,-z -Wl,relro -Wl,-z -Wl,now -o .libs/e1inp_ipa_bsc_test e1inp_ipa_bsc_test.o  ../src/.libs/libosmoabis.so -ltalloc /usr/lib/i386-linux-gnu/libosmogsm.so /usr/lib/i386-linux-gnu/libosmocore.so
[  266s] ../src/.libs/libosmoabis.so: undefined reference to `llist_count'
[  266s] collect2: error: ld returned 1 exit status
[  266s] Makefile:412: recipe for target 'e1inp_ipa_bsc_test' failed
[  266s] make[4]: *** [e1inp_ipa_bsc_test] Error 1
[  266s] make[4]: Leaving directory '/usr/src/packages/BUILD/tests'
[  266s] Makefile:577: recipe for target 'check-am' failed
[  266s] make[3]: *** [check-am] Error 2
[  266s] make[3]: Leaving directory '/usr/src/packages/BUILD/tests'
[  266s] Makefile:469: recipe for target 'check-recursive' failed
[  266s] make[2]: *** [check-recursive] Error 1
[  266s] make[2]: Leaving directory '/usr/src/packages/BUILD'
[  266s] Makefile:760: recipe for target 'check' failed
[  266s] make[1]: *** [check] Error 2
[  266s] make[1]: Leaving directory '/usr/src/packages/BUILD'
[  266s] dh_auto_test: make -j1 check returned exit code 2
[  266s] debian/rules:12: recipe for target 'build' failed
[  266s] make: *** [build] Error 2
[  266s] dpkg-buildpackage: error: debian/rules build gave error exit status 2
[  266s] 
[  266s] wildcard1 failed "build libosmo-abis_0.3.3.20170124.dsc" at Tue Jan 24 13:26:07 UTC 2017.
[  266s] 
[  266s] ### VM INTERACTION START ###
[  269s] [  244.634353] reboot: Power down
[  269s] ### VM INTERACTION END ###
[  269s] 
[  269s] wildcard1 failed "build libosmo-abis_0.3.3.20170124.dsc" at Tue Jan 24 13:26:10 UTC 2017.
[  269s] 

-- 
Configure notifications at https://build.opensuse.org/user/notifications
openSUSE Build Service (https://build.opensuse.org/)


More information about the gerrit-log mailing list