Build failure of network:osmocom:nightly/osmo-bts in xUbuntu_16.04/x86_64

OBS Notification admin at opensuse.org
Tue Jan 24 13:55:13 UTC 2017


Visit https://build.opensuse.org/package/live_build_log/network:osmocom:nightly/osmo-bts/xUbuntu_16.04/x86_64

Package network:osmocom:nightly/osmo-bts failed to build in xUbuntu_16.04/x86_64

Check out the package for editing:
  osc checkout network:osmocom:nightly osmo-bts

Last lines of build log:
[   96s] gcc -DHAVE_CONFIG_H -I. -I../..   -I../../include -I/usr/src/osmocom/openbsc/openbsc/include/ -Wdate-time -D_FORTIFY_SOURCE=2 -Wall -I/usr/include/ -I/usr/include/ -I/usr/include/ -g -O2 -fPIE -fstack-protector-strong -Wformat -Werror=format-security -c -o power_control.o power_control.c
[   96s] gcc -DHAVE_CONFIG_H -I. -I../..   -I../../include -I/usr/src/osmocom/openbsc/openbsc/include/ -Wdate-time -D_FORTIFY_SOURCE=2 -Wall -I/usr/include/ -I/usr/include/ -I/usr/include/ -g -O2 -fPIE -fstack-protector-strong -Wformat -Werror=format-security -c -o main.o main.c
[   96s] main.c:56:26: fatal error: openbsc/ctrl.h: No such file or directory
[   96s] compilation terminated.
[   96s] Makefile:389: recipe for target 'main.o' failed
[   96s] make[4]: *** [main.o] Error 1
[   96s] make[4]: Leaving directory '/usr/src/packages/BUILD/src/common'
[   96s] Makefile:341: recipe for target 'all-recursive' failed
[   96s] make[3]: *** [all-recursive] Error 1
[   96s] make[3]: Leaving directory '/usr/src/packages/BUILD/src'
[   96s] Makefile:390: recipe for target 'all-recursive' failed
[   96s] make[2]: *** [all-recursive] Error 1
[   96s] make[2]: Leaving directory '/usr/src/packages/BUILD'
[   96s] Makefile:331: recipe for target 'all' failed
[   96s] make[1]: *** [all] Error 2
[   96s] make[1]: Leaving directory '/usr/src/packages/BUILD'
[   96s] dh_auto_build: make -j1 returned exit code 2
[   96s] debian/rules:12: recipe for target 'build' failed
[   96s] make: *** [build] Error 2
[   96s] dpkg-buildpackage: error: debian/rules build gave error exit status 2
[   96s] 
[   96s] lamb10 failed "build osmo-bts_0.5.0.20170124.dsc" at Tue Jan 24 13:55:05 UTC 2017.
[   96s] 
[   96s] ### VM INTERACTION START ###
[   99s] [   87.178725] reboot: Power down
[   99s] ### VM INTERACTION END ###
[   99s] 
[   99s] lamb10 failed "build osmo-bts_0.5.0.20170124.dsc" at Tue Jan 24 13:55:09 UTC 2017.
[   99s] 

-- 
Configure notifications at https://build.opensuse.org/user/notifications
openSUSE Build Service (https://build.opensuse.org/)


More information about the gerrit-log mailing list