Build failure of network:osmocom:nightly/osmo-bts in xUbuntu_16.10/i586

OBS Notification admin at opensuse.org
Tue Jan 24 13:56:58 UTC 2017


Visit https://build.opensuse.org/package/live_build_log/network:osmocom:nightly/osmo-bts/xUbuntu_16.10/i586

Package network:osmocom:nightly/osmo-bts failed to build in xUbuntu_16.10/i586

Check out the package for editing:
  osc checkout network:osmocom:nightly osmo-bts

Last lines of build log:
[  179s] gcc -DHAVE_CONFIG_H -I. -I../..   -I../../include -I/usr/src/osmocom/openbsc/openbsc/include/ -Wdate-time -D_FORTIFY_SOURCE=2 -Wall -I/usr/include/ -I/usr/include/ -I/usr/include/ -g -O2 -fdebug-prefix-map=/usr/src/packages/BUILD=. -fPIE -fstack-protector-strong -Wformat -Werror=format-security -c -o main.o main.c
[  179s] main.c:56:26: fatal error: openbsc/ctrl.h: No such file or directory
[  179s]  #include <openbsc/ctrl.h>
[  179s]                           ^
[  179s] compilation terminated.
[  179s] Makefile:389: recipe for target 'main.o' failed
[  179s] make[4]: *** [main.o] Error 1
[  179s] make[4]: Leaving directory '/usr/src/packages/BUILD/src/common'
[  179s] Makefile:341: recipe for target 'all-recursive' failed
[  179s] make[3]: *** [all-recursive] Error 1
[  179s] make[3]: Leaving directory '/usr/src/packages/BUILD/src'
[  179s] Makefile:390: recipe for target 'all-recursive' failed
[  179s] make[2]: *** [all-recursive] Error 1
[  179s] make[2]: Leaving directory '/usr/src/packages/BUILD'
[  179s] Makefile:331: recipe for target 'all' failed
[  179s] make[1]: *** [all] Error 2
[  179s] make[1]: Leaving directory '/usr/src/packages/BUILD'
[  179s] dh_auto_build: make -j1 returned exit code 2
[  179s] debian/rules:12: recipe for target 'build' failed
[  179s] make: *** [build] Error 2
[  179s] dpkg-buildpackage: error: debian/rules build gave error exit status 2
[  179s] 
[  179s] cloud125 failed "build osmo-bts_0.5.0.20170124.dsc" at Tue Jan 24 13:56:36 UTC 2017.
[  179s] 
[  179s] ### VM INTERACTION START ###
[  184s] ### VM INTERACTION END ###
[  184s] 
[  184s] cloud125 failed "build osmo-bts_0.5.0.20170124.dsc" at Tue Jan 24 13:56:42 UTC 2017.
[  184s] 

-- 
Configure notifications at https://build.opensuse.org/user/notifications
openSUSE Build Service (https://build.opensuse.org/)


More information about the gerrit-log mailing list