libosmocore embedded build

Craig Comstock craig_comstock at yahoo.com
Thu May 18 15:42:01 UTC 2017


> Can someone else may have a
> quick look at log [2] to point me in the
> right direction? Afaics build dependencies are
> available but the
> compilation itself
> fails.
> [2] https://jenkins.osmocom.org/jenkins/job/TEST_libosmocore_arm_none_eabi/arch=arm-none-eabi,label=linux_amd64_debian8/10/console


Looks like the tests are failing. My build seems to work but when I run "make check-am" in tests I get  a different error related to talloc. This is on a Debian 8 stable box using arm-none-eabi and newlib from debian packages. Maybe the
make of timer_test fails and doesn't log somehow? I"m not sure.


craig at z500:~/libosmocore/tests$ vi timer/timer_test.
timer_test.c   timer_test.ok  
craig at z500:~/libosmocore/tests$ vi timer/timer_test.c
craig at z500:~/libosmocore/tests$ make check-am
make  timer/timer_test sms/sms_test ussd/ussd_test smscb/smscb_test bits/bitrev_test a5/a5_test conv/conv_test auth/milenage_test lapd/lapd_test gsm0808/gsm0808_test gsm0408/gsm0408_test gb/bssgp_fc_test gb/gprs_bssgp_test gb/gprs_ns_test gprs/gprs_test kasumi/kasumi_test gea/gea_test logging/logging_test fr/fr_test codec/codec_test loggingrb/loggingrb_test strrb/strrb_test vty/vty_test comp128/comp128_test utils/utils_test smscb/gsm0341_test stats/stats_test ctrl/ctrl_test bitvec/bitvec_test msgb/msgb_test bits/bitcomp_test tlv/tlv_test gsup/gsup_test oap/oap_test fsm/fsm_test write_queue/wqueue_test socket/socket_test coding/coding_test conv/conv_gsm0503_test abis/abis_test endian/endian_test sercomm/sercomm_test  
make[1]: Entering directory '/home/craig/libosmocore/tests'
  CC       timer/timer_test.o
In file included from timer/timer_test.c:31:0:
../include/osmocom/core/talloc.h:4:20: fatal error: talloc.h: No such file or directory
 #include <talloc.h>
                    ^
compilation terminated.
Makefile:1336: recipe for target 'timer/timer_test.o' failed
make[1]: *** [timer/timer_test.o] Error 1
make[1]: Leaving directory '/home/craig/libosmocore/tests'
Makefile:1529: recipe for target 'check-am' failed
make: *** [check-am] Error 2

 


More information about the baseband-devel mailing list