Build failure of network:osmocom:nightly/osmo-bsc in xUbuntu_18.04/x86_64

This is merely a historical archive of years 2008-2021, before the migration to mailman3.

A maintained and still updated list archive can be found at

OBS Notification noreply at
Mon Jul 12 02:15:58 UTC 2021


Package network:osmocom:nightly/osmo-bsc failed to build in xUbuntu_18.04/x86_64

Check out the package for editing:
  osc checkout network:osmocom:nightly osmo-bsc

Last lines of build log:
[  740s] gcc -DHAVE_CONFIG_H -I. -I../..   -I../../include  -Wdate-time -D_FORTIFY_SOURCE=2 -Wall -ggdb3 -pthread -I/usr/include/ -I/usr/include/ -I/usr/include/ -I/usr/include/ -I/usr/include/ -I/usr/include/ -I/usr/include/ -I/usr/include/  -g -O2 -fdebug-prefix-map=/usr/src/packages/BUILD=. -fstack-protector-strong -Wformat -Werror=format-security -std=gnu11 -Werror=implicit -Werror=maybe-uninitialized -Werror=memset-transposed-args -Wnull-dereference -Werror=sizeof-array-argument -Werror=sizeof-pointer-memaccess -c -o handover_test.o handover_test.c
[  742s] handover_test.c: In function 'res_ind':
[  742s] handover_test.c:1094:30: error: 'ts_str' may be used uninitialized in this function [-Werror=maybe-uninitialized]
[  742s]      char subslot_val = ts_str[lchan->nr];
[  742s]                               ^
[  742s] cc1: some warnings being treated as errors
[  742s] Makefile:569: recipe for target 'handover_test.o' failed
[  742s] make[4]: *** [handover_test.o] Error 1
[  742s] make[4]: Leaving directory '/usr/src/packages/BUILD/tests/handover'
[  742s] Makefile:420: recipe for target 'all-recursive' failed
[  742s] make[3]: *** [all-recursive] Error 1
[  742s] make[3]: Leaving directory '/usr/src/packages/BUILD/tests'
[  742s] Makefile:453: recipe for target 'all-recursive' failed
[  742s] make[2]: *** [all-recursive] Error 1
[  742s] make[2]: Leaving directory '/usr/src/packages/BUILD'
[  742s] Makefile:385: recipe for target 'all' failed
[  742s] make[1]: *** [all] Error 2
[  742s] make[1]: Leaving directory '/usr/src/packages/BUILD'
[  742s] dh_auto_build: make -j1 returned exit code 2
[  742s] debian/rules:45: recipe for target 'build' failed
[  742s] make: *** [build] Error 2
[  742s] dpkg-buildpackage: error: debian/rules build subprocess returned exit status 2
[  742s] ### VM INTERACTION START ###
[  745s] [  711.332845] sysrq: Power Off
[  745s] [  711.389366] reboot: Power down
[  746s] ### VM INTERACTION END ###
[  746s] 
[  746s] lamb17 failed "build osmo-bsc_1." at Mon Jul 12 02:15:48 UTC 2021.
[  746s] 

Configure notifications at
openSUSE Build Service (

More information about the gerrit-log mailing list