Build failure of network:osmocom:nightly/openbsc in xUbuntu_18.04/i586

This is merely a historical archive of years 2008-2021, before the migration to mailman3.

A maintained and still updated list archive can be found at https://lists.osmocom.org/hyperkitty/list/gerrit-log@lists.osmocom.org/.

OBS Notification admin at opensuse.org
Thu Mar 21 20:20:15 UTC 2019


Visit https://build.opensuse.org/package/live_build_log/network:osmocom:nightly/openbsc/xUbuntu_18.04/i586

Package network:osmocom:nightly/openbsc failed to build in xUbuntu_18.04/i586

Check out the package for editing:
  osc checkout network:osmocom:nightly openbsc

Last lines of build log:
[  283s] ../../src/libcommon/libcommon.a(talloc_ctx.o): In function `talloc_ctx_init':
[  283s] ./openbsc/src/libcommon/talloc_ctx.c:50: undefined reference to `tall_sigh_ctx'
[  283s] collect2: error: ld returned 1 exit status
[  283s] Makefile:483: recipe for target 'osmo-nitb' failed
[  283s] make[4]: *** [osmo-nitb] Error 1
[  283s] make[4]: Leaving directory '/usr/src/packages/BUILD/openbsc/src/osmo-nitb'
[  283s] Makefile:450: recipe for target 'all-recursive' failed
[  283s] make[3]: *** [all-recursive] Error 1
[  283s] make[3]: Leaving directory '/usr/src/packages/BUILD/openbsc/src'
[  283s] Makefile:470: recipe for target 'all-recursive' failed
[  283s] make[2]: *** [all-recursive] Error 1
[  283s] make[2]: Leaving directory '/usr/src/packages/BUILD/openbsc'
[  283s] Makefile:402: recipe for target 'all' failed
[  283s] make[1]: *** [all] Error 2
[  283s] make[1]: Leaving directory '/usr/src/packages/BUILD/openbsc'
[  283s] dh_auto_build: cd openbsc && make -j1 returned exit code 2
[  283s] debian/rules:13: recipe for target 'build' failed
[  283s] make: *** [build] Error 2
[  283s] dpkg-buildpackage: error: debian/rules build subprocess returned exit status 2
[  283s] 
[  283s] morla3 failed "build openbsc_1.2.0.20190321.dsc" at Thu Mar 21 20:20:11 UTC 2019.
[  283s] 
[  283s] ### VM INTERACTION START ###
[  286s] [  270.599505] sysrq: SysRq : Power Off
[  286s] [  270.699177] reboot: Power down
[  286s] ### VM INTERACTION END ###
[  286s] 
[  286s] morla3 failed "build openbsc_1.2.0.20190321.dsc" at Thu Mar 21 20:20:14 UTC 2019.
[  286s] 

-- 
Configure notifications at https://build.opensuse.org/user/notifications
openSUSE Build Service (https://build.opensuse.org/)



More information about the gerrit-log mailing list