Build failure of network:osmocom:nightly/osmo-msc in Debian_Testing/x86_64

This is merely a historical archive of years 2008-2021, before the migration to mailman3.

A maintained and still updated list archive can be found at https://lists.osmocom.org/hyperkitty/list/gerrit-log@lists.osmocom.org/.

OBS Notification admin at opensuse.org
Tue Jun 4 07:59:59 UTC 2019


Visit https://build.opensuse.org/package/live_build_log/network:osmocom:nightly/osmo-msc/Debian_Testing/x86_64

Package network:osmocom:nightly/osmo-msc failed to build in Debian_Testing/x86_64

Check out the package for editing:
  osc checkout network:osmocom:nightly osmo-msc

Last lines of build log:
[  339s] | #define HAVE_STRINGS_H 1
[  339s] | #define HAVE_INTTYPES_H 1
[  339s] | #define HAVE_STDINT_H 1
[  339s] | #define HAVE_UNISTD_H 1
[  339s] | #define HAVE_DLFCN_H 1
[  339s] | #define LT_OBJDIR ".libs/"
[  339s] | #define HAVE_LIBSCTP 1
[  339s] | #define BUILD_SMPP 1
[  339s] | #define BUILD_IU 1
[  339s] | #define STDC_HEADERS 1
[  339s] | #define HAVE_DBI_DBD_H 1
[  339s] | #define HAVE_TM_GMTOFF_IN_TM 1
[  339s] | 
[  339s] | configure: exit 0
[  339s] 
[  339s] make[1]: *** [debian/rules:63: override_dh_auto_test] Error 1
[  339s] make[1]: Leaving directory '/usr/src/packages/BUILD'
[  339s] make: *** [debian/rules:45: build] Error 2
[  339s] dpkg-buildpackage: error: debian/rules build subprocess returned exit status 2
[  339s] 
[  339s] lamb02 failed "build osmo-msc_1.3.1.133.9d61.dsc" at Tue Jun  4 07:59:51 UTC 2019.
[  339s] 
[  339s] ### VM INTERACTION START ###
[  342s] [  326.341927] sysrq: SysRq : Power Off
[  342s] [  326.347909] reboot: Power down
[  342s] ### VM INTERACTION END ###
[  342s] 
[  342s] lamb02 failed "build osmo-msc_1.3.1.133.9d61.dsc" at Tue Jun  4 07:59:54 UTC 2019.
[  342s] 

-- 
Configure notifications at https://build.opensuse.org/user/notifications
openSUSE Build Service (https://build.opensuse.org/)



More information about the gerrit-log mailing list