Build failure of network:osmocom:latest/osmo-hlr in xUbuntu_19.04/x86_64

This is merely a historical archive of years 2008-2021, before the migration to mailman3.

A maintained and still updated list archive can be found at https://lists.osmocom.org/hyperkitty/list/gerrit-log@lists.osmocom.org/.

OBS Notification admin at opensuse.org
Mon Jul 22 06:30:39 UTC 2019


Visit https://build.opensuse.org/package/live_build_log/network:osmocom:latest/osmo-hlr/xUbuntu_19.04/x86_64

Package network:osmocom:latest/osmo-hlr failed to build in xUbuntu_19.04/x86_64

Check out the package for editing:
  osc checkout network:osmocom:latest osmo-hlr

Last lines of build log:
[  127s] | #define HAVE_STDLIB_H 1
[  127s] | #define HAVE_STRING_H 1
[  127s] | #define HAVE_MEMORY_H 1
[  127s] | #define HAVE_STRINGS_H 1
[  127s] | #define HAVE_INTTYPES_H 1
[  127s] | #define HAVE_STDINT_H 1
[  127s] | #define HAVE_UNISTD_H 1
[  127s] | #define HAVE_DLFCN_H 1
[  127s] | #define LT_OBJDIR ".libs/"
[  127s] | #define PACKAGE "osmo-hlr"
[  127s] | #define VERSION "1.0.0"
[  127s] | #define STDC_HEADERS 1
[  127s] | 
[  127s] | configure: exit 0
[  127s] 
[  127s] make[1]: *** [debian/rules:17: override_dh_auto_test] Error 1
[  127s] make[1]: Leaving directory '/usr/src/packages/BUILD'
[  127s] make: *** [debian/rules:7: build] Error 2
[  127s] dpkg-buildpackage: error: debian/rules build subprocess returned exit status 2
[  127s] 
[  127s] morla3 failed "build osmo-hlr_1.0.0.dsc" at Mon Jul 22 06:30:22 UTC 2019.
[  127s] 
[  127s] ### VM INTERACTION START ###
[  130s] [  114.946859] sysrq: SysRq : Power Off
[  130s] [  114.953523] reboot: Power down
[  130s] ### VM INTERACTION END ###
[  130s] 
[  130s] morla3 failed "build osmo-hlr_1.0.0.dsc" at Mon Jul 22 06:30:26 UTC 2019.
[  130s] 

-- 
Configure notifications at https://build.opensuse.org/user/notifications
openSUSE Build Service (https://build.opensuse.org/)



More information about the gerrit-log mailing list