Build failed in Jenkins: master-osmo-msc » --disable-iu,1,a3=default,a4=default,osmocom-master-debian9 #7657

This is merely a historical archive of years 2008-2021, before the migration to mailman3.

A maintained and still updated list archive can be found at https://lists.osmocom.org/hyperkitty/list/gerrit-log@lists.osmocom.org/.

jenkins at lists.osmocom.org jenkins at lists.osmocom.org
Sun Dec 23 06:20:21 UTC 2018


See <https://jenkins.osmocom.org/jenkins/job/master-osmo-msc/IU=--disable-iu,WITH_MANUALS=1,a3=default,a4=default,label=osmocom-master-debian9/7657/display/redirect>

------------------------------------------
[...truncated 838.68 KB...]
build    10137  0.0  0.0  11128   988 ?        S    06:19   0:00 grep osmo

Connecting socket failed, retrying...
Socket: in 2 tries, connected to 127.0.0.1:4254 <socket._socketobject object at 0x7f67dbea92f0> (1 sockets open)
Terminating took 2.679s
Socket: closing 127.0.0.1:4254 <socket._socketobject object at 0x7f67dbea92f0> (0 sockets open)
Verifying src/osmo-msc/osmo-msc -c /build/writtenconfig/osmo-msc.cfgRvDWwu, test token_vty_command
Launching: PWD=/build 'src/osmo-msc/osmo-msc' '-c' '/build/writtenconfig/osmo-msc.cfgRvDWwu'

> ls -l /proc/10117/fd
total 0
lr-x------ 1 build build 64 Dec 23 06:19 0 -> pipe:[1900300650]
l-wx------ 1 build build 64 Dec 23 06:19 1 -> pipe:[1900300651]
lr-x------ 1 build build 64 Dec 23 06:19 11 -> /dev/urandom
l-wx------ 1 build build 64 Dec 23 06:19 2 -> pipe:[1900300652]
l-wx------ 1 build build 64 Dec 23 06:19 3 -> /dev/null


> ss -tn
State      Recv-Q Send-Q        Local Address:Port          Peer Address:Port 


> ss -tln
State      Recv-Q Send-Q        Local Address:Port          Peer Address:Port 


> ps xua | grep osmo
build    10117  0.8  0.0  39756 14648 ?        S    06:19   0:00 /usr/bin/python2 /usr/local/bin/osmotestconfig.py -p /build -w /build -v
build    10138  0.0  0.0 21474968780 13348 ?   R    06:19   0:00 src/osmo-msc/osmo-msc -c /build/writtenconfig/osmo-msc.cfgRvDWwu
build    10145  0.0  0.0   4336   728 ?        S    06:19   0:00 /bin/sh -c ps xua | grep osmo
build    10147  0.0  0.0  11128  1044 ?        S    06:19   0:00 grep osmo

Connecting socket failed, retrying...
Socket: in 2 tries, connected to 127.0.0.1:4254 <socket._socketobject object at 0x7f67dbea9360> (1 sockets open)
Terminating took 2.679s
Socket: closing 127.0.0.1:4254 <socket._socketobject object at 0x7f67dbea9360> (0 sockets open)
Verifying src/osmo-msc/osmo-msc -c /build/doc/examples/osmo-msc/osmo-msc_custom-sccp.cfg, test verify_doc
Launching: PWD=/build 'src/osmo-msc/osmo-msc' '-c' '/build/doc/examples/osmo-msc/osmo-msc_custom-sccp.cfg'

> ls -l /proc/10117/fd
total 0
lr-x------ 1 build build 64 Dec 23 06:19 0 -> pipe:[1900300650]
l-wx------ 1 build build 64 Dec 23 06:19 1 -> pipe:[1900300651]
lr-x------ 1 build build 64 Dec 23 06:19 11 -> /dev/urandom
l-wx------ 1 build build 64 Dec 23 06:19 2 -> pipe:[1900300652]
l-wx------ 1 build build 64 Dec 23 06:19 3 -> /dev/null


> ss -tn
State      Recv-Q Send-Q        Local Address:Port          Peer Address:Port 


> ss -tln
State      Recv-Q Send-Q        Local Address:Port          Peer Address:Port 


> ps xua | grep osmo
build    10117  0.7  0.0  39756 14648 ?        S    06:19   0:00 /usr/bin/python2 /usr/local/bin/osmotestconfig.py -p /build -w /build -v
build    10148  0.0  0.0 21474973720 14612 ?   R    06:19   0:00 src/osmo-msc/osmo-msc -c /build/doc/examples/osmo-msc/osmo-msc_custom-sccp.cfg
build    10155  0.0  0.0   4336   728 ?        S    06:19   0:00 /bin/sh -c ps xua | grep osmo
build    10157  0.0  0.0  11128   996 ?        S    06:19   0:00 grep osmo

Documentation error (missing docs): 
<command id='bind A.B.C.D [<0-65535>]'>
        <param name='[<0-65535>]' doc='(null)' />

Socket: in 1 tries, connected to 127.0.0.1:4254 <socket._socketobject object at 0x7f67dbea9360> (1 sockets open)
Terminating took 2.679s
Socket: closing 127.0.0.1:4254 <socket._socketobject object at 0x7f67dbea9360> (0 sockets open)
Verifying src/osmo-msc/osmo-msc -c /build/writtenconfig/osmo-msc_custom-sccp.cfg_kXBef, test write_config
Launching: PWD=/build 'src/osmo-msc/osmo-msc' '-c' '/build/writtenconfig/osmo-msc_custom-sccp.cfg_kXBef'

> ls -l /proc/10117/fd
total 0
lr-x------ 1 build build 64 Dec 23 06:19 0 -> pipe:[1900300650]
l-wx------ 1 build build 64 Dec 23 06:19 1 -> pipe:[1900300651]
lr-x------ 1 build build 64 Dec 23 06:19 11 -> /dev/urandom
l-wx------ 1 build build 64 Dec 23 06:19 2 -> pipe:[1900300652]
l-wx------ 1 build build 64 Dec 23 06:19 3 -> /dev/null


> ss -tn
State      Recv-Q Send-Q        Local Address:Port          Peer Address:Port 


> ss -tln
State      Recv-Q Send-Q        Local Address:Port          Peer Address:Port 


> ps xua | grep osmo
build    10117  0.6  0.0  39756 14664 ?        S    06:19   0:00 /usr/bin/python2 /usr/local/bin/osmotestconfig.py -p /build -w /build -v
build    10158  0.0  0.0 21474968780 13516 ?   R    06:20   0:00 src/osmo-msc/osmo-msc -c /build/writtenconfig/osmo-msc_custom-sccp.cfg_kXBef
build    10165  0.0  0.0   4336   800 ?        S    06:20   0:00 /bin/sh -c ps xua | grep osmo
build    10167  0.0  0.0  11128  1032 ?        S    06:20   0:00 grep osmo

Connecting socket failed, retrying...
Socket: in 2 tries, connected to 127.0.0.1:4254 <socket._socketobject object at 0x7f67dbea92f0> (1 sockets open)
Terminating took 2.679s
Socket: closing 127.0.0.1:4254 <socket._socketobject object at 0x7f67dbea92f0> (0 sockets open)
Verifying src/osmo-msc/osmo-msc -c /build/writtenconfig/osmo-msc_custom-sccp.cfg_kXBef, test token_vty_command
Launching: PWD=/build 'src/osmo-msc/osmo-msc' '-c' '/build/writtenconfig/osmo-msc_custom-sccp.cfg_kXBef'

> ls -l /proc/10117/fd
total 0
lr-x------ 1 build build 64 Dec 23 06:19 0 -> pipe:[1900300650]
l-wx------ 1 build build 64 Dec 23 06:19 1 -> pipe:[1900300651]
lr-x------ 1 build build 64 Dec 23 06:19 11 -> /dev/urandom
l-wx------ 1 build build 64 Dec 23 06:19 2 -> pipe:[1900300652]
l-wx------ 1 build build 64 Dec 23 06:19 3 -> /dev/null


> ss -tn
State      Recv-Q Send-Q        Local Address:Port          Peer Address:Port 


> ss -tln
State      Recv-Q Send-Q        Local Address:Port          Peer Address:Port 


> ps xua | grep osmo
build    10117  0.5  0.0  39756 14664 ?        S    06:19   0:00 /usr/bin/python2 /usr/local/bin/osmotestconfig.py -p /build -w /build -v
build    10168  0.0  0.0 21474968780 13980 ?   R    06:20   0:00 src/osmo-msc/osmo-msc -c /build/writtenconfig/osmo-msc_custom-sccp.cfg_kXBef
build    10175  0.0  0.0   4336   812 ?        S    06:20   0:00 /bin/sh -c ps xua | grep osmo
build    10177  0.0  0.0   4336   104 ?        R    06:20   0:00 /bin/sh -c ps xua | grep osmo

Connecting socket failed, retrying...
Socket: in 2 tries, connected to 127.0.0.1:4254 <socket._socketobject object at 0x7f67dbea9360> (1 sockets open)
Terminating took 2.679s
Socket: closing 127.0.0.1:4254 <socket._socketobject object at 0x7f67dbea9360> (0 sockets open)
Verifying src/osmo-msc/osmo-msc -c /build/doc/examples/osmo-msc/osmo-msc_multi-cs7.cfg, test verify_doc
Launching: PWD=/build 'src/osmo-msc/osmo-msc' '-c' '/build/doc/examples/osmo-msc/osmo-msc_multi-cs7.cfg'

> ls -l /proc/10117/fd
total 0
lr-x------ 1 build build 64 Dec 23 06:19 0 -> pipe:[1900300650]
l-wx------ 1 build build 64 Dec 23 06:19 1 -> pipe:[1900300651]
lr-x------ 1 build build 64 Dec 23 06:19 11 -> /dev/urandom
l-wx------ 1 build build 64 Dec 23 06:19 2 -> pipe:[1900300652]
l-wx------ 1 build build 64 Dec 23 06:19 3 -> /dev/null


> ss -tn
State      Recv-Q Send-Q        Local Address:Port          Peer Address:Port 


> ss -tln
State      Recv-Q Send-Q        Local Address:Port          Peer Address:Port 


> ps xua | grep osmo
build    10117  0.4  0.0  39756 14664 ?        S    06:19   0:00 /usr/bin/python2 /usr/local/bin/osmotestconfig.py -p /build -w /build -v
build    10178  0.0  0.0 21474968780 13720 ?   R    06:20   0:00 src/osmo-msc/osmo-msc -c /build/doc/examples/osmo-msc/osmo-msc_multi-cs7.cfg
build    10185  0.0  0.0   4336   764 ?        S    06:20   0:00 /bin/sh -c ps xua | grep osmo
build    10187  0.0  0.0   4336   104 ?        R    06:20   0:00 /bin/sh -c ps xua | grep osmo

Documentation error (missing docs): 
<command id='bind A.B.C.D [<0-65535>]'>
        <param name='[<0-65535>]' doc='(null)' />

Socket: in 1 tries, connected to 127.0.0.1:4254 <socket._socketobject object at 0x7f67dbea9360> (1 sockets open)
Terminating took 2.679s
Socket: closing 127.0.0.1:4254 <socket._socketobject object at 0x7f67dbea9360> (0 sockets open)
Verifying src/osmo-msc/osmo-msc -c /build/writtenconfig/osmo-msc_multi-cs7.cfgfzz_v3, test write_config
Launching: PWD=/build 'src/osmo-msc/osmo-msc' '-c' '/build/writtenconfig/osmo-msc_multi-cs7.cfgfzz_v3'

> ls -l /proc/10117/fd
total 0
lr-x------ 1 build build 64 Dec 23 06:19 0 -> pipe:[1900300650]
l-wx------ 1 build build 64 Dec 23 06:19 1 -> pipe:[1900300651]
lr-x------ 1 build build 64 Dec 23 06:19 11 -> /dev/urandom
l-wx------ 1 build build 64 Dec 23 06:19 2 -> pipe:[1900300652]
l-wx------ 1 build build 64 Dec 23 06:19 3 -> /dev/null


> ss -tn
State      Recv-Q Send-Q        Local Address:Port          Peer Address:Port 


> ss -tln
State      Recv-Q Send-Q        Local Address:Port          Peer Address:Port 


> ps xua | grep osmo
build    10117  0.4  0.0  39756 14664 ?        S    06:19   0:00 /usr/bin/python2 /usr/local/bin/osmotestconfig.py -p /build -w /build -v
build    10188  2.0  0.0 21474968780 13300 ?   R    06:20   0:00 src/osmo-msc/osmo-msc -c /build/writtenconfig/osmo-msc_multi-cs7.cfgfzz_v3
build    10195  0.0  0.0   4336   812 ?        S    06:20   0:00 /bin/sh -c ps xua | grep osmo
build    10197  0.0  0.0  11128   992 ?        S    06:20   0:00 grep osmo

Connecting socket failed, retrying...
Socket: in 2 tries, connected to 127.0.0.1:4254 <socket._socketobject object at 0x7f67dbea92f0> (1 sockets open)
Terminating took 2.679s
Socket: closing 127.0.0.1:4254 <socket._socketobject object at 0x7f67dbea92f0> (0 sockets open)
Verifying src/osmo-msc/osmo-msc -c /build/writtenconfig/osmo-msc_multi-cs7.cfgfzz_v3, test token_vty_command
Launching: PWD=/build 'src/osmo-msc/osmo-msc' '-c' '/build/writtenconfig/osmo-msc_multi-cs7.cfgfzz_v3'

> ls -l /proc/10117/fd
total 0
lr-x------ 1 build build 64 Dec 23 06:19 0 -> pipe:[1900300650]
l-wx------ 1 build build 64 Dec 23 06:19 1 -> pipe:[1900300651]
lr-x------ 1 build build 64 Dec 23 06:19 11 -> /dev/urandom
l-wx------ 1 build build 64 Dec 23 06:19 2 -> pipe:[1900300652]
l-wx------ 1 build build 64 Dec 23 06:19 3 -> /dev/null


> ss -tn
State      Recv-Q Send-Q        Local Address:Port          Peer Address:Port 


> ss -tln
State      Recv-Q Send-Q        Local Address:Port          Peer Address:Port 


> ps xua | grep osmo
build    10117  0.4  0.0  39756 14664 ?        S    06:19   0:00 /usr/bin/python2 /usr/local/bin/osmotestconfig.py -p /build -w /build -v
build    10198  0.0  0.0 21474968780 13740 ?   R    06:20   0:00 src/osmo-msc/osmo-msc -c /build/writtenconfig/osmo-msc_multi-cs7.cfgfzz_v3
build    10205  0.0  0.0   4336   712 ?        S    06:20   0:00 /bin/sh -c ps xua | grep osmo
build    10207  0.0  0.0  11128   956 ?        S    06:20   0:00 grep osmo

ERRORS: 3
Connecting socket failed, retrying...
Socket: in 2 tries, connected to 127.0.0.1:4254 <socket._socketobject object at 0x7f67dbea9360> (1 sockets open)
Terminating took 2.679s
Socket: closing 127.0.0.1:4254 <socket._socketobject object at 0x7f67dbea9360> (0 sockets open)
make[7]: *** [vty-python-test] Error 3
Makefile:706: recipe for target 'vty-python-test' failed
make[7]: Leaving directory '/build/tests'
Makefile:723: recipe for target 'vty-test' failed
make[6]: Leaving directory '/build/tests'
make[6]: *** [vty-test] Error 2
Makefile:698: recipe for target 'python-tests' failed
make[5]: Leaving directory '/build/tests'
make[5]: *** [python-tests] Error 2
make[4]: *** [check-local] Error 2
Makefile:746: recipe for target 'check-local' failed
make[4]: Leaving directory '/build/tests'
Makefile:559: recipe for target 'check-am' failed
make[3]: Leaving directory '/build/tests'
make[3]: *** [check-am] Error 2
Makefile:411: recipe for target 'check-recursive' failed
make[2]: Leaving directory '/build/tests'
make[2]: *** [check-recursive] Error 1
Makefile:452: recipe for target 'check-recursive' failed
make[1]: Leaving directory '/build'
make[1]: *** [check-recursive] Error 1
make: *** [check] Error 2
Makefile:743: recipe for target 'check' failed
+ cat-testlogs.sh
Build step 'Execute shell' marked build as failure
[WARNINGS]Skipping publisher since build result is FAILURE



More information about the gerrit-log mailing list