Build failure of network:osmocom:nightly/openbsc in xUbuntu_17.04/i586

This is merely a historical archive of years 2008-2021, before the migration to mailman3.

A maintained and still updated list archive can be found at https://lists.osmocom.org/hyperkitty/list/gerrit-log@lists.osmocom.org/.

OBS Notification admin at opensuse.org
Mon Apr 24 15:21:51 UTC 2017


Visit https://build.opensuse.org/package/live_build_log/network:osmocom:nightly/openbsc/xUbuntu_17.04/i586

Package network:osmocom:nightly/openbsc failed to build in xUbuntu_17.04/i586

Check out the package for editing:
  osc checkout network:osmocom:nightly openbsc

Last lines of build log:
[  110s] gcc -DHAVE_CONFIG_H -I. -I../..   -I../../include -I../..  -Wdate-time -D_FORTIFY_SOURCE=2 -Wall -I/usr/include/ -I/usr/include/ -I/usr/include/ -I/usr/include/ -I/usr/include/ -I/usr/include/ -I/usr/include/    -g -O2 -fdebug-prefix-map=/usr/src/packages/BUILD=. -fPIE -fstack-protector-strong -Wformat -Werror=format-security -Werror=implicit -Werror=maybe-uninitialized -Werror=memset-transposed-args -Werror=null-dereference -Werror=sizeof-array-argument -Werror=sizeof-pointer-memaccess -c -o bsc_nat_filter.o bsc_nat_filter.c
[  111s] gcc -Wall -I/usr/include/ -I/usr/include/ -I/usr/include/ -I/usr/include/ -I/usr/include/ -I/usr/include/ -I/usr/include/    -g -O2 -fdebug-prefix-map=/usr/src/packages/BUILD=. -fPIE -fstack-protector-strong -Wformat -Werror=format-security -Werror=implicit -Werror=maybe-uninitialized -Werror=memset-transposed-args -Werror=null-dereference -Werror=sizeof-array-argument -Werror=sizeof-pointer-memaccess   -Wl,-Bsymbolic-functions -fPIE -pie -Wl,-z,relro -Wl,-z,now -o osmo-bsc_nat bsc_filter.o bsc_mgcp_utils.o bsc_nat.o bsc_nat_utils.o bsc_nat_vty.o bsc_sccp.o bsc_ussd.o bsc_nat_ctrl.o bsc_nat_rewrite.o bsc_nat_rewrite_trie.o bsc_nat_filter.o ../../src/libmgcp/libmgcp.a ../../src/libfilter/libfilter.a ../../src/libbsc/libbsc.a ../../src/libcommon-cs/libcommon-cs.a ../../src/libtrau/libtrau.a ../../src/libcommon/libcommon.a -losmosccp -losmoxua -ltalloc -losmocore -ltalloc -losmogsm -losmocore -ltalloc -losmovty -losmocore -ltalloc -losmoctrl -losmogsm -losmocore -losmoabis -losmonetif -lcrypto -lrt  
[  111s] /usr/lib/gcc/i686-linux-gnu/6/../../../i386-linux-gnu/libosmosccp.so: undefined reference to `talloc_free'
[  111s] collect2: error: ld returned 1 exit status
[  111s] Makefile:460: recipe for target 'osmo-bsc_nat' failed
[  111s] make[4]: *** [osmo-bsc_nat] Error 1
[  111s] make[4]: Leaving directory '/usr/src/packages/BUILD/openbsc/src/osmo-bsc_nat'
[  111s] Makefile:418: recipe for target 'all-recursive' failed
[  111s] make[3]: *** [all-recursive] Error 1
[  111s] make[3]: Leaving directory '/usr/src/packages/BUILD/openbsc/src'
[  111s] Makefile:486: recipe for target 'all-recursive' failed
[  111s] make[2]: *** [all-recursive] Error 1
[  111s] make[2]: Leaving directory '/usr/src/packages/BUILD/openbsc'
[  111s] Makefile:404: recipe for target 'all' failed
[  111s] make[1]: *** [all] Error 2
[  111s] make[1]: Leaving directory '/usr/src/packages/BUILD/openbsc'
[  111s] dh_auto_build: make -j1 returned exit code 2
[  111s] debian/rules:13: recipe for target 'build' failed
[  111s] make: *** [build] Error 2
[  111s] dpkg-buildpackage: error: debian/rules build gave error exit status 2
[  111s] 
[  111s] wildcard3 failed "build openbsc_0.15.1.20170423.dsc" at Mon Apr 24 15:21:44 UTC 2017.
[  111s] 
[  111s] ### VM INTERACTION START ###
[  114s] [   99.054356] reboot: Power down
[  114s] ### VM INTERACTION END ###
[  114s] 
[  114s] wildcard3 failed "build openbsc_0.15.1.20170423.dsc" at Mon Apr 24 15:21:47 UTC 2017.
[  114s] 

-- 
Configure notifications at https://build.opensuse.org/user/notifications
openSUSE Build Service (https://build.opensuse.org/)



More information about the gerrit-log mailing list