[op25-dev] Beta Test of New Additions - compile error on make

Joseph Cardani jcardani@verizon.net [op25-dev] op25-dev at yahoogroups.com
Sun Nov 29 00:46:46 UTC 2015


So I changed the recipe name from gr-op25.lwr to op25.lwr and it worked. Weird. Anyway now the more important issue. How do I fix Balint’s version?

Did you get the new code working?

thanks
Joe






> On Nov 28, 2015, at 7:41 PM, Joseph Cardani jcardani at verizon.net [op25-dev] <op25-dev at yahoogroups.com> wrote:
> 
> I renamed from op25 to gr-op25 and Failed again. 
> 
> Gonna try one more thing but Here's the output:
> 
> jcardani at jcardani-ThinkCentre-XXXX ~/pybombs/src $ dir
> airspy    bladeRF  gnuradio  gr-iqbal  gr-op25  gr-op25baz  gr-osmosdr  hackrf  libosmo-dsp  osmo-sdr  rtl-sdr  uhd
> jcardani at jcardani-ThinkCentre-XXXX ~/pybombs/src $ cd ~
> jcardani at jcardani-ThinkCentre-XXXX ~ $ cd pybombs
> jcardani at jcardani-ThinkCentre-XXXX ~/pybombs $ ./pybombs rb gr-op25
> Settled on prefix: /home/jcardani/target
> Loading recipes ...
> Installing packages:
> * gr-op25
> Installing from source: gr-op25
> Configuring: (100%) [==========================================================]
> Configuration failed. Re-trying with higher verbosity.
> /bin/sh: 1: cd: can't cd to /home/jcardani/pybombs/src/op25/build
> make[2]: *** [op25/gr-op25/swig/CMakeFiles/op25_swig_swig_doc.dir/depend] Error 2
> make[1]: *** [op25/gr-op25/swig/CMakeFiles/op25_swig_swig_doc.dir/all] Error 2
> make[1]: *** Waiting for unfinished jobs....
> /bin/sh: 1: cd: can't cd to /home/jcardani/pybombs/src/op25/build
> make[2]: *** [op25/gr-op25/python/CMakeFiles/pygen_op25_gr_op25_python_efd2f.dir/depend] Error 2
> make[1]: *** [op25/gr-op25/python/CMakeFiles/pygen_op25_gr_op25_python_efd2f.dir/all] Error 2
> /bin/sh: 1: cd: can't cd to /home/jcardani/pybombs/src/op25/build
> make[2]: *** [op25/gr-op25/apps/CMakeFiles/pygen_op25_gr_op25_apps_383eb.dir/depend] Error 2
> make[1]: *** [op25/gr-op25/apps/CMakeFiles/pygen_op25_gr_op25_apps_383eb.dir/all] Error 2
> /bin/sh: 1: cd: can't cd to /home/jcardani/pybombs/src/op25/build
> make[2]: *** [op25/gr-op25/lib/CMakeFiles/gnuradio-op25.dir/depend] Error 2
> make[1]: *** [op25/gr-op25/lib/CMakeFiles/gnuradio-op25.dir/all] Error 2
> make: *** [all] Error 2
> Build failed. See output above for error messages.
> jcardani at jcardani-ThinkCentre-XXXX ~/pybombs $ 
> 
> 
> 
> 
> 
> 
> 
> 
> On 11/28/2015 07:31 PM, verymetl at hotmail.com <mailto:verymetl at hotmail.com> [op25-dev] wrote:
>>  
>> Well that's weird... your directory name is "op25". Did you clone this yourself and compile manually? No way pybombs did this based on the recipe name.
>> 
>> 
>> You can try and rename the "op25" to "gr-op25" and issue a "./pybombs rb gr-op25"
>> 
>> 
>> 
>> ---In op25-dev at yahoogroups.com <mailto:op25-dev at yahoogroups.com>, <jcardani at ...> <mailto:jcardani at ...> wrote :
>> 
>> Hi Scott.
>> 
>> 
>> Here's the output
>> 
>> jcardani at jcardani-ThinkCentre-XXXX ~ $ ls ~/pybombs/src
>> airspy  bladeRF  gnuradio  gr-iqbal  gr-op25baz  gr-osmosdr  hackrf  libosmo-dsp  op25  osmo-sdr  rtl-sdr  uhd
>> jcardani at jcardani-ThinkCentre-XXXX ~ $ 
>> 
>> 
>> 
> 
> 
> 

-------------- next part --------------
An HTML attachment was scrubbed...
URL: <http://lists.osmocom.org/pipermail/op25-dev/attachments/20151128/c0921c30/attachment.html>


More information about the op25-dev mailing list