Build failed in Jenkins: master-osmo-sgsn » --enable-iu,0,a3=default,a4=default,osmocom-master-debian9 #13958

This is merely a historical archive of years 2008-2021, before the migration to mailman3.

A maintained and still updated list archive can be found at https://lists.osmocom.org/hyperkitty/list/jenkins-notifications@lists.osmocom.org/.

jenkins at lists.osmocom.org jenkins at lists.osmocom.org
Tue Oct 29 01:14:31 UTC 2019


See <https://jenkins.osmocom.org/jenkins/job/master-osmo-sgsn/IU=--enable-iu,WITH_MANUALS=0,a3=default,a4=default,label=osmocom-master-debian9/13958/display/redirect>

------------------------------------------
[...truncated 793.65 KB...]
State      Recv-Q Send-Q Local Address:Port               Peer Address:Port              


> ss -tln
State      Recv-Q Send-Q Local Address:Port               Peer Address:Port              
LISTEN     0      10     127.0.0.1:4246                     *:*                  
LISTEN     0      10     127.0.0.1:4263                     *:*                  


> ps xua | grep osmo
build    29105  3.4  0.0  43480 19252 ?        S    01:14   0:00 /usr/bin/python2 /usr/local/bin/osmotestconfig.py -p /build -w /build -v
build    29128  0.0  0.0 21474963724 14908 ?   S    01:14   0:00 src/gbproxy/osmo-gbproxy -c /build/writtenconfig/osmo-gbproxy-legacy.cfgcR4Udi
build    29135  0.0  0.0   4276   744 ?        S    01:14   0:00 /bin/sh -c ps xua | grep osmo
build    29137  0.0  0.0  12780   940 ?        S    01:14   0:00 grep osmo

Socket: in 1 tries, connected to 127.0.0.1:4246 <socket._socketobject object at 0x7ffff5d08d00> (1 sockets open)
Terminating took 0.897s
Socket: closing 127.0.0.1:4246 <socket._socketobject object at 0x7ffff5d08d00> (0 sockets open)
Verifying src/gbproxy/osmo-gbproxy -c /build/writtenconfig/osmo-gbproxy-legacy.cfgcR4Udi, test token_vty_command
Launching: PWD=/build 'src/gbproxy/osmo-gbproxy' '-c' '/build/writtenconfig/osmo-gbproxy-legacy.cfgcR4Udi'

> ls -l /proc/29105/fd
total 0
lr-x------ 1 build build 64 Oct 29 01:14 0 -> pipe:[1041472527]
l-wx------ 1 build build 64 Oct 29 01:14 1 -> pipe:[1041472528]
lr-x------ 1 build build 64 Oct 29 01:14 11 -> /dev/urandom
l-wx------ 1 build build 64 Oct 29 01:14 2 -> pipe:[1041472529]
l-wx------ 1 build build 64 Oct 29 01:14 3 -> /dev/null


> ss -tn
State      Recv-Q Send-Q Local Address:Port               Peer Address:Port              


> ss -tln
State      Recv-Q Send-Q Local Address:Port               Peer Address:Port              


> ps xua | grep osmo
build    29105  2.4  0.0  43480 19252 ?        S    01:14   0:00 /usr/bin/python2 /usr/local/bin/osmotestconfig.py -p /build -w /build -v
build    29139  0.0  0.0 21474963724 14208 ?   R    01:14   0:00 src/gbproxy/osmo-gbproxy -c /build/writtenconfig/osmo-gbproxy-legacy.cfgcR4Udi
build    29146  0.0  0.0   4276   744 ?        S    01:14   0:00 /bin/sh -c ps xua | grep osmo
build    29148  0.0  0.0  12780   940 ?        S    01:14   0:00 grep osmo

Connecting socket failed, retrying...
Socket: in 2 tries, connected to 127.0.0.1:4246 <socket._socketobject object at 0x7ffff5d08d70> (1 sockets open)
Terminating took 0.897s
Socket: closing 127.0.0.1:4246 <socket._socketobject object at 0x7ffff5d08d70> (0 sockets open)
Verifying src/sgsn/osmo-sgsn -c /build/doc/examples/osmo-sgsn/osmo-sgsn.cfg, test verify_doc
Launching: PWD=/build 'src/sgsn/osmo-sgsn' '-c' '/build/doc/examples/osmo-sgsn/osmo-sgsn.cfg'

> ls -l /proc/29105/fd
total 0
lr-x------ 1 build build 64 Oct 29 01:14 0 -> pipe:[1041472527]
l-wx------ 1 build build 64 Oct 29 01:14 1 -> pipe:[1041472528]
lr-x------ 1 build build 64 Oct 29 01:14 11 -> /dev/urandom
l-wx------ 1 build build 64 Oct 29 01:14 2 -> pipe:[1041472529]
l-wx------ 1 build build 64 Oct 29 01:14 3 -> /dev/null


> ss -tn
State      Recv-Q Send-Q Local Address:Port               Peer Address:Port              


> ss -tln
State      Recv-Q Send-Q Local Address:Port               Peer Address:Port              


> ps xua | grep osmo
build    29105  2.2  0.0  43480 19252 ?        S    01:14   0:00 /usr/bin/python2 /usr/local/bin/osmotestconfig.py -p /build -w /build -v
build    29150  0.0  0.0 21475052732 19292 ?   R    01:14   0:00 src/sgsn/osmo-sgsn -c /build/doc/examples/osmo-sgsn/osmo-sgsn.cfg
build    29157  0.0  0.0   4276   744 ?        S    01:14   0:00 /bin/sh -c ps xua | grep osmo
build    29159  0.0  0.0  12780   940 ?        S    01:14   0:00 grep osmo

Socket: in 1 tries, connected to 127.0.0.1:4245 <socket._socketobject object at 0x7ffff5d52de0> (1 sockets open)
Terminating took 0.897s
Socket: closing 127.0.0.1:4245 <socket._socketobject object at 0x7ffff5d52de0> (0 sockets open)
Verifying src/sgsn/osmo-sgsn -c /build/writtenconfig/osmo-sgsn.cfgspyVif, test write_config
Launching: PWD=/build 'src/sgsn/osmo-sgsn' '-c' '/build/writtenconfig/osmo-sgsn.cfgspyVif'

> ls -l /proc/29105/fd
total 0
lr-x------ 1 build build 64 Oct 29 01:14 0 -> pipe:[1041472527]
l-wx------ 1 build build 64 Oct 29 01:14 1 -> pipe:[1041472528]
lr-x------ 1 build build 64 Oct 29 01:14 11 -> /dev/urandom
l-wx------ 1 build build 64 Oct 29 01:14 2 -> pipe:[1041472529]
l-wx------ 1 build build 64 Oct 29 01:14 3 -> /dev/null


> ss -tn
State      Recv-Q Send-Q Local Address:Port               Peer Address:Port              


> ss -tln
State      Recv-Q Send-Q Local Address:Port               Peer Address:Port              


> ps xua | grep osmo
build    29105  1.8  0.0  43628 19404 ?        S    01:14   0:00 /usr/bin/python2 /usr/local/bin/osmotestconfig.py -p /build -w /build -v
build    29161  0.0  0.0 21474986552 19292 ?   D    01:14   0:00 src/sgsn/osmo-sgsn -c /build/writtenconfig/osmo-sgsn.cfgspyVif
build    29168  0.0  0.0   4276   744 ?        S    01:14   0:00 /bin/sh -c ps xua | grep osmo
build    29170  0.0  0.0  12780   940 ?        S    01:14   0:00 grep osmo

Socket: in 1 tries, connected to 127.0.0.1:4245 <socket._socketobject object at 0x7ffff5d52de0> (1 sockets open)
Terminating took 0.897s
Socket: closing 127.0.0.1:4245 <socket._socketobject object at 0x7ffff5d52de0> (0 sockets open)
Verifying src/sgsn/osmo-sgsn -c /build/writtenconfig/osmo-sgsn.cfgspyVif, test token_vty_command
Launching: PWD=/build 'src/sgsn/osmo-sgsn' '-c' '/build/writtenconfig/osmo-sgsn.cfgspyVif'

> ls -l /proc/29105/fd
total 0
lr-x------ 1 build build 64 Oct 29 01:14 0 -> pipe:[1041472527]
l-wx------ 1 build build 64 Oct 29 01:14 1 -> pipe:[1041472528]
lr-x------ 1 build build 64 Oct 29 01:14 11 -> /dev/urandom
l-wx------ 1 build build 64 Oct 29 01:14 2 -> pipe:[1041472529]
l-wx------ 1 build build 64 Oct 29 01:14 3 -> /dev/null


> ss -tn
State      Recv-Q Send-Q Local Address:Port               Peer Address:Port              


> ss -tln
State      Recv-Q Send-Q Local Address:Port               Peer Address:Port              


> ps xua | grep osmo
build    29105  1.5  0.0  43628 19404 ?        S    01:14   0:00 /usr/bin/python2 /usr/local/bin/osmotestconfig.py -p /build -w /build -v
build    29172  0.0  0.0 21474982324 19012 ?   R    01:14   0:00 src/sgsn/osmo-sgsn -c /build/writtenconfig/osmo-sgsn.cfgspyVif
build    29179  0.0  0.0   4276   744 ?        S    01:14   0:00 /bin/sh -c ps xua | grep osmo
build    29181  0.0  0.0  12780   940 ?        S    01:14   0:00 grep osmo

Socket: in 1 tries, connected to 127.0.0.1:4245 <socket._socketobject object at 0x7ffff5d52de0> (1 sockets open)
Terminating took 0.897s
Socket: closing 127.0.0.1:4245 <socket._socketobject object at 0x7ffff5d52de0> (0 sockets open)
Verifying src/gtphub/osmo-gtphub -c /build/doc/examples/osmo-gtphub/osmo-gtphub-1iface.cfg, test verify_doc
Launching: PWD=/build 'src/gtphub/osmo-gtphub' '-c' '/build/doc/examples/osmo-gtphub/osmo-gtphub-1iface.cfg'

> ls -l /proc/29105/fd
total 0
lr-x------ 1 build build 64 Oct 29 01:14 0 -> pipe:[1041472527]
l-wx------ 1 build build 64 Oct 29 01:14 1 -> pipe:[1041472528]
lr-x------ 1 build build 64 Oct 29 01:14 11 -> /dev/urandom
l-wx------ 1 build build 64 Oct 29 01:14 2 -> pipe:[1041472529]
l-wx------ 1 build build 64 Oct 29 01:14 3 -> /dev/null


> ss -tn
State      Recv-Q Send-Q Local Address:Port               Peer Address:Port              


> ss -tln
State      Recv-Q Send-Q Local Address:Port               Peer Address:Port              


> ps xua | grep osmo
build    29105  1.5  0.0  43628 19404 ?        S    01:14   0:00 /usr/bin/python2 /usr/local/bin/osmotestconfig.py -p /build -w /build -v
build    29183  0.0  0.0 21474965848 14276 ?   S    01:14   0:00 src/gtphub/osmo-gtphub -c /build/doc/examples/osmo-gtphub/osmo-gtphub-1iface.cfg
build    29190  0.0  0.0   4276   744 ?        S    01:14   0:00 /bin/sh -c ps xua | grep osmo
build    29192  0.0  0.0  12780   940 ?        S    01:14   0:00 grep osmo

Socket: in 1 tries, connected to 127.0.0.1:4253 <socket._socketobject object at 0x7ffff5d52de0> (1 sockets open)
Terminating took 0.897s
Socket: closing 127.0.0.1:4253 <socket._socketobject object at 0x7ffff5d52de0> (0 sockets open)
Verifying src/gtphub/osmo-gtphub -c /build/writtenconfig/osmo-gtphub-1iface.cfgl11v5R, test write_config
Launching: PWD=/build 'src/gtphub/osmo-gtphub' '-c' '/build/writtenconfig/osmo-gtphub-1iface.cfgl11v5R'

> ls -l /proc/29105/fd
total 0
lr-x------ 1 build build 64 Oct 29 01:14 0 -> pipe:[1041472527]
l-wx------ 1 build build 64 Oct 29 01:14 1 -> pipe:[1041472528]
lr-x------ 1 build build 64 Oct 29 01:14 11 -> /dev/urandom
l-wx------ 1 build build 64 Oct 29 01:14 2 -> pipe:[1041472529]
l-wx------ 1 build build 64 Oct 29 01:14 3 -> /dev/null


> ss -tn
State      Recv-Q Send-Q Local Address:Port               Peer Address:Port              


> ss -tln
State      Recv-Q Send-Q Local Address:Port               Peer Address:Port              


> ps xua | grep osmo
build    29105  1.5  0.0  43628 19404 ?        S    01:14   0:00 /usr/bin/python2 /usr/local/bin/osmotestconfig.py -p /build -w /build -v
build    29194  0.0  0.0 21474965848 14276 ?   D    01:14   0:00 src/gtphub/osmo-gtphub -c /build/writtenconfig/osmo-gtphub-1iface.cfgl11v5R
build    29201  0.0  0.0   4276   744 ?        S    01:14   0:00 /bin/sh -c ps xua | grep osmo
build    29203  0.0  0.0  12780   940 ?        S    01:14   0:00 grep osmo

Socket: in 1 tries, connected to 127.0.0.1:4253 <socket._socketobject object at 0x7ffff5d52de0> (1 sockets open)
Terminating took 0.897s
Socket: closing 127.0.0.1:4253 <socket._socketobject object at 0x7ffff5d52de0> (0 sockets open)
Verifying src/gtphub/osmo-gtphub -c /build/writtenconfig/osmo-gtphub-1iface.cfgl11v5R, test token_vty_command
Launching: PWD=/build 'src/gtphub/osmo-gtphub' '-c' '/build/writtenconfig/osmo-gtphub-1iface.cfgl11v5R'

> ls -l /proc/29105/fd
total 0
lr-x------ 1 build build 64 Oct 29 01:14 0 -> pipe:[1041472527]
l-wx------ 1 build build 64 Oct 29 01:14 1 -> pipe:[1041472528]
lr-x------ 1 build build 64 Oct 29 01:14 11 -> /dev/urandom
l-wx------ 1 build build 64 Oct 29 01:14 2 -> pipe:[1041472529]
l-wx------ 1 build build 64 Oct 29 01:14 3 -> /dev/null


> ss -tn
State      Recv-Q Send-Q Local Address:Port               Peer Address:Port              


> ss -tln
State      Recv-Q Send-Q Local Address:Port               Peer Address:Port              


> ps xua | grep osmo
build    29105  1.3  0.0  43628 19404 ?        S    01:14   0:00 /usr/bin/python2 /usr/local/bin/osmotestconfig.py -p /build -w /build -v
build    29205  0.0  0.0 21474965848 14148 ?   D    01:14   0:00 src/gtphub/osmo-gtphub -c /build/writtenconfig/osmo-gtphub-1iface.cfgl11v5R
build    29212  0.0  0.0   4276   744 ?        S    01:14   0:00 /bin/sh -c ps xua | grep osmo
build    29214  0.0  0.0  12780   940 ?        S    01:14   0:00 grep osmo

ERRORS: 1
Socket: in 1 tries, connected to 127.0.0.1:4253 <socket._socketobject object at 0x7ffff5d52de0> (1 sockets open)
Terminating took 0.897s
Socket: closing 127.0.0.1:4253 <socket._socketobject object at 0x7ffff5d52de0> (0 sockets open)
make[7]: *** [vty-python-test] Error 1
Makefile:710: recipe for target 'vty-python-test' failed
make[7]: Leaving directory '/build/tests'
Makefile:727: recipe for target 'vty-test' failed
make[6]: Leaving directory '/build/tests'
make[6]: *** [vty-test] Error 2
make[5]: *** [python-tests] Error 2
Makefile:704: recipe for target 'python-tests' failed
make[5]: Leaving directory '/build/tests'
Makefile:735: recipe for target 'check-local' failed
make[4]: Leaving directory '/build/tests'
make[4]: *** [check-local] Error 2
Makefile:564: recipe for target 'check-am' failed
make[3]: Leaving directory '/build/tests'
make[3]: *** [check-am] Error 2
Makefile:416: recipe for target 'check-recursive' failed
make[2]: Leaving directory '/build/tests'
make[2]: *** [check-recursive] Error 1
Makefile:453: recipe for target 'check-recursive' failed
make[1]: Leaving directory '/build'
make[1]: *** [check-recursive] Error 1
Makefile:744: recipe for target 'check' failed
make: *** [check] Error 2
+ cat-testlogs.sh
Build step 'Execute shell' marked build as failure
[WARNINGS]Skipping publisher since build result is FAILURE



More information about the jenkins-notifications mailing list