Build failure of network:osmocom:nightly/simtrace2 in xUbuntu_20.04/x86_64

OBS Notification admin at opensuse.org
Wed Mar 17 01:43:43 UTC 2021


Visit https://build.opensuse.org/package/live_build_log/network:osmocom:nightly/simtrace2/xUbuntu_20.04/x86_64

Package network:osmocom:nightly/simtrace2 failed to build in xUbuntu_20.04/x86_64

Check out the package for editing:
  osc checkout network:osmocom:nightly simtrace2

Last lines of build log:
[  187s] [COMPILING apps/dfu/main.c]
[  187s] [COMPILING ./atmel_softpack_libraries/usb/device/dfu/dfu.c]
[  187s] [COMPILING ./atmel_softpack_libraries/usb/device/dfu/dfu_desc.c]
[  187s] [COMPILING ./atmel_softpack_libraries/usb/device/dfu/dfu_driver.c]
[  187s] Memory region         Used Size  Region Size  %age Used
[  187s]              rom:       16600 B        16 KB    101.32%
[  187s]              ram:       11688 B        48 KB     23.78/usr/lib/gcc/arm-none-eabi/9.2.1/../../../arm-none-eabi/bin/ld: warning: changing start of section .stack by 4 bytes
[  187s] /usr/lib/gcc/arm-none-eabi/9.2.1/../../../arm-none-eabi/bin/ld: warning: changing start of section .stack by 4 bytes
[  187s] /usr/lib/gcc/arm-none-eabi/9.2.1/../../../arm-none-eabi/bin/ld: bin/qmod-dfu-flash.elf section `.text' will not fit in region `rom'
[  187s] /usr/lib/gcc/arm-none-eabi/9.2.1/../../../arm-none-eabi/bin/ld: warning: changing start of section .stack by 4 bytes
[  187s] /usr/lib/gcc/arm-none-eabi/9.2.1/../../../arm-none-eabi/bin/ld: warning: changing start of section .stack by 4 bytes
[  187s] /usr/lib/gcc/arm-none-eabi/9.2.1/../../../arm-none-eabi/bin/ld: warning: changing start of section .stack by 4 bytes
[  187s] /usr/lib/gcc/arm-none-eabi/9.2.1/../../../arm-none-eabi/bin/ld: region `rom' overflowed by 216 bytes
[  187s] collect2: error: ld returned 1 exit status
[  187s] %
[  187s] make[2]: *** [Makefile:230: flash] Error 1
[  187s] make[2]: Leaving directory '/usr/src/packages/BUILD/firmware'
[  187s] make[1]: *** [Makefile:13: fw-qmod-dfu] Error 2
[  187s] make[1]: Leaving directory '/usr/src/packages/BUILD'
[  187s] dh_auto_build: error: make -j1 returned exit code 2
[  187s] make: *** [debian/rules:16: build] Error 25
[  187s] dpkg-buildpackage: error: debian/rules build subprocess returned exit status 2
[  187s] ### VM INTERACTION START ###
[  191s] [  177.539089] sysrq: Power Off
[  191s] [  177.552182] reboot: Power down
[  191s] ### VM INTERACTION END ###
[  191s] 
[  191s] sheep88 failed "build simtrace2_0.7.0.76.62ad.dsc" at Wed Mar 17 01:43:34 UTC 2021.
[  191s] 

-- 
Configure notifications at https://build.opensuse.org/my/subscriptions
openSUSE Build Service (https://build.opensuse.org/)


More information about the gerrit-log mailing list