Build failure of network:osmocom:nightly/simtrace2 in xUbuntu_20.04/x86_64

OBS Notification admin at opensuse.org
Wed Mar 3 02:01:10 UTC 2021


Visit https://build.opensuse.org/package/live_build_log/network:osmocom:nightly/simtrace2/xUbuntu_20.04/x86_64

Package network:osmocom:nightly/simtrace2 failed to build in xUbuntu_20.04/x86_64

Check out the package for editing:
  osc checkout network:osmocom:nightly simtrace2

Last lines of build log:
[  176s] [COMPILING libboard/qmod/source/wwan_perst.c]
[  176s] [COMPILING libboard/qmod/source/card_pres.c]
[  176s] [COMPILING libboard/qmod/source/wwan_led.c]
[  176s] [COMPILING libboard/qmod/source/i2c.c]
[  176s] [COMPILING libboard/qmod/source/board_qmod.c]
[  177s] [COMPILING apps/dfu/main.c]
[  177s] [COMPILING ./atmel_softpack_libraries/usb/device/dfu/dfu.c]
[  177s] [COMPILING ./atmel_softpack_libraries/usb/device/dfu/dfu_desc.c]
[  177s] [COMPILING ./atmel_softpack_libraries/usb/device/dfu/dfu_driver.c]
[  177s] Memory region         Used Size  Region Size  %age Used
[  177s]              rom:       16588 B        16 KB    101.25%
[  177s]              ram:       11672 B        48 KB     23.75/usr/lib/gcc/arm-none-eabi/9.2.1/../../../arm-none-eabi/bin/ld: bin/qmod-dfu-flash.elf section `.text' will not fit in region `rom'
[  177s] /usr/lib/gcc/arm-none-eabi/9.2.1/../../../arm-none-eabi/bin/ld: region `rom' overflowed by 204 bytes
[  177s] collect2: error: ld returned 1 exit status
[  177s] %
[  177s] make[2]: *** [Makefile:234: flash] Error 1
[  177s] make[2]: Leaving directory '/usr/src/packages/BUILD/firmware'
[  177s] make[1]: *** [Makefile:13: fw-qmod-dfu] Error 2
[  177s] make[1]: Leaving directory '/usr/src/packages/BUILD'
[  177s] dh_auto_build: error: make -j1 returned exit code 2
[  177s] make: *** [debian/rules:16: build] Error 25
[  177s] dpkg-buildpackage: error: debian/rules build subprocess returned exit status 2
[  177s] ### VM INTERACTION START ###
[  180s] [  168.688630] sysrq: Power Off
[  180s] [  168.695892] reboot: Power down
[  181s] ### VM INTERACTION END ###
[  181s] 
[  181s] lamb05 failed "build simtrace2_0.7.0.70.657c.dsc" at Wed Mar  3 02:00:58 UTC 2021.
[  181s] 

-- 
Configure notifications at https://build.opensuse.org/my/subscriptions
openSUSE Build Service (https://build.opensuse.org/)


More information about the gerrit-log mailing list